{"text_format":"1","workbook":"xlsx","n_sheets":8,"sheets":["Orçamento","Resumo ","Somatório","Cronog_120_Dias","Composição BDI","Relatório CENTRAL","Parc Maior Relev","Composições"],"not_rendered":{"charts":0,"images":4,"macros":1,"external_links":1,"defined_names":124,"comments":3,"pivot_tables":0},"unopened":[],"bounds":{"document_bytes":16777216,"sheet_cells":100000,"rows_first":2000,"rows_last":500,"rows_between":2000,"halvings":0,"cell_chars":16384,"cell_head_chars":4096},"cells_cut":0,"cells_raw":0,"read":"whole","date_system":"1900"}

{"sheet":"Orçamento","index":0,"n_rows":507,"n_cols":24,"rows_kept":507,"cut":false,"hidden":false,"merged":[[488,18,488,20],[488,21,488,22],[489,15,489,17],[489,18,489,20],[489,21,489,22],[490,15,490,17],[490,18,490,20],[490,21,490,22],[485,15,485,17],[485,18,485,20],[485,21,485,22],[486,15,486,17],[486,18,486,20],[486,21,486,22],[487,15,487,17],[487,18,487,20],[487,21,487,22],[499,18,499,20],[499,21,499,22],[494,15,494,17],[494,18,494,20],[494,21,494,22],[495,15,495,17],[495,18,495,20],[495,21,495,22],[496,15,496,17],[496,18,496,20],[496,21,496,22],[475,14,475,17],[482,15,482,17],[448,15,448,17],[503,18,503,20],[503,21,503,22],[491,15,491,17],[491,18,491,20],[491,21,491,22],[492,15,492,17],[492,18,492,20],[492,21,492,22],[493,15,493,17],[493,18,493,20],[493,21,493,22],[497,15,497,17],[497,18,497,20],[497,21,497,22],[498,15,498,17],[498,18,498,20],[498,21,498,22],[499,15,499,17],[488,15,488,17],[443,16,443,22],[506,18,506,20],[506,21,506,22],[503,14,503,17],[500,15,500,17],[500,18,500,20],[500,21,500,22],[501,15,501,17],[501,18,501,20],[501,21,501,22],[502,15,502,17],[502,18,502,20],[502,21,502,22],[505,18,505,20],[505,21,505,22],[504,18,504,20],[504,21,504,22],[481,14,481,23],[482,18,482,20],[482,21,482,22],[483,15,483,17],[483,18,483,20],[483,21,483,22],[484,15,484,17],[484,18,484,20],[484,21,484,22],[439,16,439,22],[440,16,440,22],[441,16,441,22],[3,21,3,22],[2,21,2,22],[5,21,5,22],[10,14,10,23],[13,14,13,23],[6,21,6,22],[9,17,9,20],[2,14,2,20],[3,14,3,20],[5,18,5,20],[6,18,6,20],[11,18,11,20],[12,18,12,20],[6,14,6,17],[5,14,5,17],[461,15,461,17],[462,15,462,17],[463,15,463,17],[464,15,464,17],[465,15,465,17],[466,15,466,17],[467,15,467,17],[468,15,468,17],[469,15,469,17],[449,15,449,17],[450,15,450,17],[451,15,451,17],[452,15,452,17],[453,15,453,17],[454,15,454,17],[455,15,455,17],[456,15,456,17],[457,15,457,17],[470,15,470,17],[471,15,471,17],[472,15,472,17],[473,15,473,17],[474,15,474,17],[447,14,447,23],[436,20,436,21],[435,20,435,21],[431,17,436,17],[431,20,431,21],[448,18,448,20],[448,21,448,22],[449,18,449,20],[449,21,449,22],[437,20,437,21],[457,18,457,20],[457,21,457,22],[458,18,458,20],[458,21,458,22],[459,18,459,20],[459,21,459,22],[460,18,460,20],[460,21,460,22],[472,18,472,20],[475,18,475,20],[475,21,475,22],[472,21,472,22],[473,18,473,20],[473,21,473,22],[474,18,474,20],[474,21,474,22],[464,18,464,20],[464,21,464,22],[471,18,471,20],[471,21,471,22],[466,21,466,22],[467,18,467,20],[467,21,467,22],[469,18,469,20],[465,18,465,20],[465,21,465,22],[466,18,466,20],[476,18,476,20],[476,21,476,22],[463,18,463,20],[463,21,463,22],[456,18,456,20],[456,21,456,22],[478,18,478,20],[478,21,478,22],[432,20,432,21],[454,18,454,20],[454,21,454,22],[455,18,455,20],[455,21,455,22],[453,18,453,20],[453,21,453,22],[462,18,462,20],[433,20,433,21],[444,18,444,22],[450,18,450,20],[450,21,450,22],[451,18,451,20],[451,21,451,22],[452,18,452,20],[452,21,452,22],[442,16,442,22],[8,12,9,12],[477,18,477,20],[477,21,477,22],[0,14,0,22],[8,14,8,16],[9,14,9,16],[11,14,11,16],[12,14,12,16],[14,14,14,22],[1,14,1,22],[4,14,4,22],[7,14,7,22],[461,18,461,20],[461,21,461,22],[469,21,469,22],[458,15,458,17],[459,15,459,17],[460,15,460,17],[462,21,462,22],[470,18,470,20],[470,21,470,22],[468,18,468,20],[468,21,468,22]]}
[]
[]
[null,null,null,null,null,null,null,null,null,null,null,null,null,null,"UNIDADE ESCOLAR",null,null,null,null,null,null,"CÓDIGO INEP"]
[null,null,null,null,null,null,null,null,null,null,null,null,null,null,"CENTRO DE ENSINO EM PERÍODO INTEGRAL PEDRO XAVIER TEIXEIRA",null,null,null,null,null,null,52033562]
[]
["Nmax",null,null,null,null,null,null,null,null,null,null,null,null,null,"OBRA",null,null,null,"DATA",null,null,"CIDADE"]
[{"$f":"MAX($C$18:$C$431)","v":4},null,null,null,null,null,null,null,null,null,null,null,null,null,"REFORMA",null,null,null,"2020-03-25",null,null,"GOIÂNIA"]
[]
[null,null,null,null,null,null,null,null,null,null,null,null,"",null,"CRE",null,null,"ENDEREÇO",null,null,null,"REFERÊNCIA AGETOP"]
[null,null,null,null,null,null,null,null,null,null,null,null,null,null,"GOIÂNIA",null,null,"RUA 1027 Nº 70 70, SETOR PEDRO LUDOVICO, CEP:74825-040",null,null,null,"DEZ/18","ONERADA"]
[]
[null,null,null,null,null,null,null,null,null,null,null,null,null,null,"ÁREA EXISTENTE (M²)",null,null,"ÁREA A CONSTRUIR (M²)","ÁREA TOTAL CONSTRUÍDA (M²)",null,null,"REFERÊNCIA SINAPI"]
[null,null,null,null,null,null,null,null,null,null,null,null,null,null,4083.99,null,null,null,4083.99,null,null,"AGO/19","ONERADA"]
[]
[null,null,null,null,null,null,null,null,null,null,null,"FILTRO",null,null,"PLANILHA ORÇAMENTÁRIA"]
["Nível E","Save Nivel","Nível C","Altura","n1","n2","n3","n4","n5","Czero","Cnível","↓","Nível","Nível Corrigido","ITEM","TABELA","CODIGO","DESCRIÇÃO DOS SERVIÇOS","UNID","QUANT","MAT","MO","T.SERVIÇO","OBSERVAÇÕES¹"]
[{"$f":"CHOOSE(1+LOG(1+2*(ORÇAMENTO.Nivel=\"Nível 1\")+4*(ORÇAMENTO.Nivel=\"Nível 2\")+8*(ORÇAMENTO.Nivel=\"Nível 3\")+16*(ORÇAMENTO.Nivel=\"Nível 4\")+32*(ORÇAMENTO.Nivel=\"Serviço\"),2),0,1,2,3,4,\"S\")","v":"S"},{"$f":"IF(OR(C17=\"s\",C17=0),OFFSET(B17,-1,0),C17)","v":"Save Nivel"},{"$f":"IF(OFFSET(C17,-1,0)=\"L\",1,IF(OFFSET(C17,-1,0)=1,2,IF(OR(A17=\"s\",A17=0),\"S\",IF(AND(OFFSET(C17,-1,0)=2,A17=4),3,IF(AND(OR(OFFSET(C17,-1,0)=\"s\",OFFSET(C17,-1,0)=0),A17<>\"s\",A17>OFFSET(B17,-1,0)),OFFSET(B17,-1,0),A17)))))","v":"S"},{"$f":"IF(OR(C17=\"S\",C17=0),0,IF(ISERROR(K17),J17,SMALL(J17:K17,1)))","v":0},{"$f":"IF($C17=1,OFFSET(E17,-1,0)+1,OFFSET(E17,-1,0))","v":"n1"},{"$f":"IF($C17=1,0,IF($C17=2,OFFSET(F17,-1,0)+1,OFFSET(F17,-1,0)))","v":"n2"},{"$f":"IF(AND($C17<=2,$C17<>0),0,IF($C17=3,OFFSET(G17,-1,0)+1,OFFSET(G17,-1,0)))","v":"n3"},{"$f":"IF(AND($C17<=3,$C17<>0),0,IF($C17=4,OFFSET(H17,-1,0)+1,OFFSET(H17,-1,0)))","v":"n4"},{"$f":"IF(AND($C17<=4,$C17<>0),0,IF(AND($C17=\"S\",$W17>0),OFFSET(I17,-1,0)+1,OFFSET(I17,-1,0)))","v":"n5"},{"$f":"IF(OR($C17=\"S\",$C17=0),0,MATCH(0,OFFSET($D17,1,$C17,ROW($C$431)-ROW($C17)),0))","v":0},{"$f":"IF(OR($C17=\"S\",$C17=0),0,MATCH(OFFSET($D17,0,$C17)+1,OFFSET($D17,1,$C17,ROW($C$431)-ROW($C17)),0))","v":0},{"$f":"IF(OR(W17>0,$C17=1),\"F\",\"\")","v":""},"Serviço","Serviço","-","AGETOP",null,"(sem código)","-",null,0,0,0,""]
[0,null,"L",{"$f":"COUNTA(OFFSET(D18,1,0):D$431)","v":412},{"$f":"LEFT(O19,1)-1","v":0},null,null,null,null,null,null,"F","LOTE","LOTE","REFORMA - CENTRO DE ENSINO EM PERÍODO INTEGRAL PEDRO XAVIER TEIXEIRA",null,null,null,null,null,null,null,0]
[1,{"$f":"IF(OR(C19=\"s\",C19=0),OFFSET(B19,-1,0),C19)","v":1},{"$f":"IF(OFFSET(C19,-1,0)=\"L\",1,IF(OFFSET(C19,-1,0)=1,2,IF(OR(A19=\"s\",A19=0),\"S\",IF(AND(OFFSET(C19,-1,0)=2,A19=4),3,IF(AND(OR(OFFSET(C19,-1,0)=\"s\",OFFSET(C19,-1,0)=0),A19<>\"s\",A19>OFFSET(B19,-1,0)),OFFSET(B19,-1,0),A19)))))","v":1},{"$f":"IF(OR(C19=\"S\",C19=0),0,IF(ISERROR(K19),J19,SMALL(J19:K19,1)))","v":412},{"$f":"IF($C19=1,OFFSET(E19,-1,0)+1,OFFSET(E19,-1,0))","v":1},{"$f":"IF($C19=1,0,IF($C19=2,OFFSET(F19,-1,0)+1,OFFSET(F19,-1,0)))","v":0},{"$f":"IF(AND($C19<=2,$C19<>0),0,IF($C19=3,OFFSET(G19,-1,0)+1,OFFSET(G19,-1,0)))","v":0},{"$f":"IF(AND($C19<=3,$C19<>0),0,IF($C19=4,OFFSET(H19,-1,0)+1,OFFSET(H19,-1,0)))","v":0},0,{"$f":"IF(OR($C19=\"S\",$C19=0),0,MATCH(0,OFFSET($D19,1,$C19,ROW($C$431)-ROW($C19)),0))","v":412},{"$f":"IF(OR($C19=\"S\",$C19=0),0,MATCH(OFFSET($D19,0,$C19)+1,OFFSET($D19,1,$C19,ROW($C$431)-ROW($C19)),0))","v":{"$error":"#N/A"}},{"$f":"IF(OR(W19>0,$C19=1),\"F\",\"\")","v":"F"},"Nível 1","Nível 1","1.","AGETOP",null,"REFORMA",null,null,null,null,0]
[2,{"$f":"IF(OR(C20=\"s\",C20=0),OFFSET(B20,-1,0),C20)","v":2},{"$f":"IF(OFFSET(C20,-1,0)=\"L\",1,IF(OFFSET(C20,-1,0)=1,2,IF(OR(A20=\"s\",A20=0),\"S\",IF(AND(OFFSET(C20,-1,0)=2,A20=4),3,IF(AND(OR(OFFSET(C20,-1,0)=\"s\",OFFSET(C20,-1,0)=0),A20<>\"s\",A20>OFFSET(B20,-1,0)),OFFSET(B20,-1,0),A20)))))","v":2},{"$f":"IF(OR(C20=\"S\",C20=0),0,IF(ISERROR(K20),J20,SMALL(J20:K20,1)))","v":44},{"$f":"IF($C20=1,OFFSET(E20,-1,0)+1,OFFSET(E20,-1,0))","v":1},{"$f":"IF($C20=1,0,IF($C20=2,OFFSET(F20,-1,0)+1,OFFSET(F20,-1,0)))","v":1},{"$f":"IF(AND($C20<=2,$C20<>0),0,IF($C20=3,OFFSET(G20,-1,0)+1,OFFSET(G20,-1,0)))","v":0},{"$f":"IF(AND($C20<=3,$C20<>0),0,IF($C20=4,OFFSET(H20,-1,0)+1,OFFSET(H20,-1,0)))","v":0},0,411,44,"","Nível 2","Nível 2","-","AGETOP",null,"SERVIÇOS PRELIMINARES",null,null,null,null,0]
[3,3,3,2,1,1,1,0,0,43,2,"","Nível 3","Nível 3","-","SINAPI",null,"ACESSIBILIDADE CALÇADA","-",null,null,null,0,""]
["S",3,"S",0,1,1,1,0,0,0,0,"","Serviço","Serviço","-","AGETOP",20121,"DEM. MANUAL EM CONCR.SIMPLES C/TR.ATE CB.E CARGA (O.C.)","m3    ",95.042500000000004,null,null,0,""]
[3,3,3,10,1,1,2,0,0,41,10,"","Nível 3","Nível 3","-","SINAPI",null,"BANHEIROSS / VESTIÁRIOS","-",null,null,null,0,""]
["S",3,"S",0,1,1,2,0,0,0,0,"","Serviço","Serviço","-","SINAPI",97622,"DEMOLIÇÃO DE ALVENARIA DE BLOCO FURADO, DE FORMA MANUAL, SEM REAPROVEITAMENTO. AF_12/2017","M3",7.8989999999999991,null,null,0,"Referência: AGETOP - 20118"]
["S",3,"S",0,1,1,2,0,0,0,0,"","Serviço","Serviço","-","AGETOP",20139,"DEMOLIÇAO DE BANCADAS C/ TRANSP. ATÉ CB. E CARGA","m2    ",3.6,null,null,0,""]
["S",3,"S",0,1,1,2,0,0,0,0,"","Serviço","Serviço","-","SINAPI",97633,"DEMOLIÇÃO DE REVESTIMENTO CERÂMICO, DE FORMA MANUAL, SEM REAPROVEITAMENTO. AF_12/2017","M2",255.13,null,null,0,"Referência: AGETOP - 20115"]
["S",{"$f":"IF(OR(C27=\"s\",C27=0),OFFSET(B27,-1,0),C27)","v":3},{"$f":"IF(OFFSET(C27,-1,0)=\"L\",1,IF(OFFSET(C27,-1,0)=1,2,IF(OR(A27=\"s\",A27=0),\"S\",IF(AND(OFFSET(C27,-1,0)=2,A27=4),3,IF(AND(OR(OFFSET(C27,-1,0)=\"s\",OFFSET(C27,-1,0)=0),A27<>\"s\",A27>OFFSET(B27,-1,0)),OFFSET(B27,-1,0),A27)))))","v":"S"},{"$f":"IF(OR(C27=\"S\",C27=0),0,IF(ISERROR(K27),J27,SMALL(J27:K27,1)))","v":0},{"$f":"IF($C27=1,OFFSET(E27,-1,0)+1,OFFSET(E27,-1,0))","v":1},{"$f":"IF($C27=1,0,IF($C27=2,OFFSET(F27,-1,0)+1,OFFSET(F27,-1,0)))","v":1},{"$f":"IF(AND($C27<=2,$C27<>0),0,IF($C27=3,OFFSET(G27,-1,0)+1,OFFSET(G27,-1,0)))","v":2},{"$f":"IF(AND($C27<=3,$C27<>0),0,IF($C27=4,OFFSET(H27,-1,0)+1,OFFSET(H27,-1,0)))","v":0},0,0,0,{"$f":"IF(OR(W27>0,$C27=1),\"F\",\"\")","v":""},"Serviço","Serviço","-","SINAPI",97644,"REMOÇÃO DE PORTAS, DE FORMA MANUAL, SEM REAPROVEITAMENTO. AF_12/2017","M2",10.080000000000002,null,null,0,"Referência: AGETOP - 20106"]
["S",3,"S",0,1,1,2,0,0,0,0,"","Serviço","Serviço","-","SINAPI",97645,"REMOÇÃO DE JANELAS, DE FORMA MANUAL, SEM REAPROVEITAMENTO. AF_12/2017","M2",8.4,null,null,0,"Referência: AGETOP - 20106"]
["S",3,"S",0,1,1,2,0,0,0,0,"","Serviço","Serviço","-","AGETOP",20137,"DEMOLIÇAO BACIA SANITARIA C/ TRANSP. ATÉ CB. E CARGA","Un    ",10,null,null,0,""]
["S",3,"S",0,1,1,2,0,0,0,0,"","Serviço","Serviço","-","AGETOP",20140,"DEMOLIÇAO DE VÁLVULA DE DESCARGA C/ TRANSP. ATÉ CB. E CARGA","Un    ",7,null,null,0,""]
["S",3,"S",0,1,1,2,0,0,0,0,"","Serviço","Serviço","-","AGETOP",20146,"DEMOLIÇÃO DE MICTÓRIO C/ TRANSP. ATÉ CB. E CARGA","Un    ",4,null,null,0,""]
["S",3,"S",0,1,1,2,0,0,0,0,"","Serviço","Serviço","-","AGETOP",20163,"DEMOLIÇÃO DAS INSTALAÇÕES HIDROSANITÁRIAS E AFINS C/ TRANSP. ATÉ CB. E CARGA","H     ",4,null,null,0,""]
[3,3,3,2,1,1,3,0,0,31,2,"","Nível 3","Nível 3","-","SINAPI",null,"REFORMA ELÉTRICA","-",null,null,null,0,""]
["S",3,"S",0,1,1,3,0,0,0,0,"","Serviço","Serviço","-","AGETOP",20162,"DEMOLIÇÃO DAS INSTALAÇÕES ELÉTRICAS E AFINS C/ TRANSP. ATÉ CB. E CARGA","H     ",24,null,null,0,""]
[3,3,3,15,1,1,4,0,0,29,15,"","Nível 3","Nível 3","-","SINAPI",null,"COBERTURA BLOCO 5","-",null,null,null,0,""]
["S",{"$f":"IF(OR(C36=\"s\",C36=0),OFFSET(B36,-1,0),C36)","v":3},{"$f":"IF(OFFSET(C36,-1,0)=\"L\",1,IF(OFFSET(C36,-1,0)=1,2,IF(OR(A36=\"s\",A36=0),\"S\",IF(AND(OFFSET(C36,-1,0)=2,A36=4),3,IF(AND(OR(OFFSET(C36,-1,0)=\"s\",OFFSET(C36,-1,0)=0),A36<>\"s\",A36>OFFSET(B36,-1,0)),OFFSET(B36,-1,0),A36)))))","v":"S"},{"$f":"IF(OR(C36=\"S\",C36=0),0,IF(ISERROR(K36),J36,SMALL(J36:K36,1)))","v":0},{"$f":"IF($C36=1,OFFSET(E36,-1,0)+1,OFFSET(E36,-1,0))","v":1},{"$f":"IF($C36=1,0,IF($C36=2,OFFSET(F36,-1,0)+1,OFFSET(F36,-1,0)))","v":1},{"$f":"IF(AND($C36<=2,$C36<>0),0,IF($C36=3,OFFSET(G36,-1,0)+1,OFFSET(G36,-1,0)))","v":4},{"$f":"IF(AND($C36<=3,$C36<>0),0,IF($C36=4,OFFSET(H36,-1,0)+1,OFFSET(H36,-1,0)))","v":0},0,0,0,{"$f":"IF(OR(W36>0,$C36=1),\"F\",\"\")","v":""},"Serviço","Serviço","-","SINAPI",98533,"PODA EM ALTURA DE ÁRVORE COM DIÂMETRO DE TRONCO MAIOR OU IGUAL A 0,20 M E MENOR QUE 0,40 M.AF_05/2018","UN",5,null,null,0,""]
["S",3,"S",0,1,1,4,0,0,0,0,"","Serviço","Serviço","-","SINAPI",98529,"CORTE RASO E RECORTE DE ÁRVORE COM DIÂMETRO DE TRONCO MAIOR OU IGUAL A 0,20 M E MENOR QUE 0,40 M.AF_05/2018","UN",5,null,null,0,""]
["S",{"$f":"IF(OR(C38=\"s\",C38=0),OFFSET(B38,-1,0),C38)","v":3},{"$f":"IF(OFFSET(C38,-1,0)=\"L\",1,IF(OFFSET(C38,-1,0)=1,2,IF(OR(A38=\"s\",A38=0),\"S\",IF(AND(OFFSET(C38,-1,0)=2,A38=4),3,IF(AND(OR(OFFSET(C38,-1,0)=\"s\",OFFSET(C38,-1,0)=0),A38<>\"s\",A38>OFFSET(B38,-1,0)),OFFSET(B38,-1,0),A38)))))","v":"S"},{"$f":"IF(OR(C38=\"S\",C38=0),0,IF(ISERROR(K38),J38,SMALL(J38:K38,1)))","v":0},{"$f":"IF($C38=1,OFFSET(E38,-1,0)+1,OFFSET(E38,-1,0))","v":1},{"$f":"IF($C38=1,0,IF($C38=2,OFFSET(F38,-1,0)+1,OFFSET(F38,-1,0)))","v":1},{"$f":"IF(AND($C38<=2,$C38<>0),0,IF($C38=3,OFFSET(G38,-1,0)+1,OFFSET(G38,-1,0)))","v":4},{"$f":"IF(AND($C38<=3,$C38<>0),0,IF($C38=4,OFFSET(H38,-1,0)+1,OFFSET(H38,-1,0)))","v":0},0,0,0,{"$f":"IF(OR(W38>0,$C38=1),\"F\",\"\")","v":""},"Serviço","Serviço","-","SINAPI",98526,"REMOÇÃO DE RAÍZES REMANESCENTES DE TRONCO DE ÁRVORE COM DIÂMETRO MAIOR OU IGUAL A 0,20 M E MENOR QUE 0,40 M.AF_05/2018","UN",5,null,null,0,""]
["S",3,"S",0,1,1,4,0,0,0,0,"","Serviço","Serviço","-","SINAPI",97622,"DEMOLIÇÃO DE ALVENARIA DE BLOCO FURADO, DE FORMA MANUAL, SEM REAPROVEITAMENTO. AF_12/2017","M3",2.7719999999999998,null,null,0,"Referência: AGETOP - 20118"]
["S",3,"S",0,1,1,4,0,0,0,0,"","Serviço","Serviço","-","AGETOP",20109,"DEM.PISO CIMENT.SOBRE LASTRO CONC.C/TR.ATE CB. E CARGA","m2    ",188.83,null,null,0,""]
["S",3,"S",0,1,1,4,0,0,0,0,"","Serviço","Serviço","-","AGETOP",20137,"DEMOLIÇAO BACIA SANITARIA C/ TRANSP. ATÉ CB. E CARGA","Un    ",2,null,null,0,""]
["S",3,"S",0,1,1,4,0,0,0,0,"","Serviço","Serviço","-","AGETOP",20140,"DEMOLIÇAO DE VÁLVULA DE DESCARGA C/ TRANSP. ATÉ CB. E CARGA","Un    ",2,null,null,0,""]
["S",3,"S",0,1,1,4,0,0,0,0,"","Serviço","Serviço","-","AGETOP",20163,"DEMOLIÇÃO DAS INSTALAÇÕES HIDROSANITÁRIAS E AFINS C/ TRANSP. ATÉ CB. E CARGA","H     ",2,null,null,0,""]
["S",{"$f":"IF(OR(C44=\"s\",C44=0),OFFSET(B44,-1,0),C44)","v":3},{"$f":"IF(OFFSET(C44,-1,0)=\"L\",1,IF(OFFSET(C44,-1,0)=1,2,IF(OR(A44=\"s\",A44=0),\"S\",IF(AND(OFFSET(C44,-1,0)=2,A44=4),3,IF(AND(OR(OFFSET(C44,-1,0)=\"s\",OFFSET(C44,-1,0)=0),A44<>\"s\",A44>OFFSET(B44,-1,0)),OFFSET(B44,-1,0),A44)))))","v":"S"},{"$f":"IF(OR(C44=\"S\",C44=0),0,IF(ISERROR(K44),J44,SMALL(J44:K44,1)))","v":0},{"$f":"IF($C44=1,OFFSET(E44,-1,0)+1,OFFSET(E44,-1,0))","v":1},{"$f":"IF($C44=1,0,IF($C44=2,OFFSET(F44,-1,0)+1,OFFSET(F44,-1,0)))","v":1},{"$f":"IF(AND($C44<=2,$C44<>0),0,IF($C44=3,OFFSET(G44,-1,0)+1,OFFSET(G44,-1,0)))","v":4},{"$f":"IF(AND($C44<=3,$C44<>0),0,IF($C44=4,OFFSET(H44,-1,0)+1,OFFSET(H44,-1,0)))","v":0},0,0,0,{"$f":"IF(OR(W44>0,$C44=1),\"F\",\"\")","v":""},"Serviço","Serviço","-","AGETOP",20121,"DEM. MANUAL EM CONCR.SIMPLES C/TR.ATE CB.E CARGA (O.C.)","m3    ",2.3190000000000004,null,null,0,""]
["S",3,"S",0,1,1,4,0,0,0,0,"","Serviço","Serviço","-","AGETOP",20101,"DEMOLICAO COBERTURA TELHA CERAMICA C/ TRANSP. ATÉ CB. E CARGA","m2    ",1242.51,null,null,0,""]
["S",3,"S",0,1,1,4,0,0,0,0,"","Serviço","Serviço","-","AGETOP",20103,"DEMOLIÇÃO ESTRUTURA EM MADEIRA TELHADO C/ TRANSP. ATÉ CB. E CARGA","m2    ",1242.51,null,null,0,""]
["S",3,"S",0,1,1,4,0,0,0,0,"","Serviço","Serviço","-","AGETOP",20157,"DEMOLIÇÃO CALHAS/ RUFOS EM CHAPA C/TR.AT.C.B.E CARGA","m2    ",4.5419999999999998,null,null,0,""]
["S",{"$f":"IF(OR(C48=\"s\",C48=0),OFFSET(B48,-1,0),C48)","v":3},{"$f":"IF(OFFSET(C48,-1,0)=\"L\",1,IF(OFFSET(C48,-1,0)=1,2,IF(OR(A48=\"s\",A48=0),\"S\",IF(AND(OFFSET(C48,-1,0)=2,A48=4),3,IF(AND(OR(OFFSET(C48,-1,0)=\"s\",OFFSET(C48,-1,0)=0),A48<>\"s\",A48>OFFSET(B48,-1,0)),OFFSET(B48,-1,0),A48)))))","v":"S"},{"$f":"IF(OR(C48=\"S\",C48=0),0,IF(ISERROR(K48),J48,SMALL(J48:K48,1)))","v":0},{"$f":"IF($C48=1,OFFSET(E48,-1,0)+1,OFFSET(E48,-1,0))","v":1},{"$f":"IF($C48=1,0,IF($C48=2,OFFSET(F48,-1,0)+1,OFFSET(F48,-1,0)))","v":1},{"$f":"IF(AND($C48<=2,$C48<>0),0,IF($C48=3,OFFSET(G48,-1,0)+1,OFFSET(G48,-1,0)))","v":4},{"$f":"IF(AND($C48<=3,$C48<>0),0,IF($C48=4,OFFSET(H48,-1,0)+1,OFFSET(H48,-1,0)))","v":0},0,0,0,{"$f":"IF(OR(W48>0,$C48=1),\"F\",\"\")","v":""},"Serviço","Serviço","-","SINAPI",97644,"REMOÇÃO DE PORTAS, DE FORMA MANUAL, SEM REAPROVEITAMENTO. AF_12/2017","M2",18.48,null,null,0,"Referência: AGETOP - 20106"]
["S",3,"S",0,1,1,4,0,0,0,0,"","Serviço","Serviço","-","SINAPI",97645,"REMOÇÃO DE JANELAS, DE FORMA MANUAL, SEM REAPROVEITAMENTO. AF_12/2017","M2",4.2,null,null,0,"Referência: AGETOP - 20106"]
[3,3,3,2,1,1,5,0,0,14,2,"","Nível 3","Nível 3","-","SINAPI",null,"FORRO","-",null,null,null,0,""]
["S",3,"S",0,1,1,5,0,0,0,0,"","Serviço","Serviço","-","AGETOP",20147,"DEMOLIÇÃO DE FORRO PVC  INCLUSIVE ESTRUTURA DE SUSTENTAÇÃO C/ TRANSP. ATÉ CB. E CARGA","m2    ",732.77,null,null,0,""]
[3,3,3,8,1,1,6,0,0,12,8,"","Nível 3","Nível 3","-","SINAPI",null,"READEQUAÇÕES DA COZINHA","-",null,null,null,0,""]
["S",3,"S",0,1,1,6,0,0,0,0,"","Serviço","Serviço","-","SINAPI",97622,"DEMOLIÇÃO DE ALVENARIA DE BLOCO FURADO, DE FORMA MANUAL, SEM REAPROVEITAMENTO. AF_12/2017","M3",18.725999999999999,null,null,0,"Referência: AGETOP - 20118"]
["S",3,"S",0,1,1,6,0,0,0,0,"","Serviço","Serviço","-","AGETOP",20139,"DEMOLIÇAO DE BANCADAS C/ TRANSP. ATÉ CB. E CARGA","m2    ",7.64,null,null,0,""]
["S",3,"S",0,1,1,6,0,0,0,0,"","Serviço","Serviço","-","AGETOP",20163,"DEMOLIÇÃO DAS INSTALAÇÕES HIDROSANITÁRIAS E AFINS C/ TRANSP. ATÉ CB. E CARGA","H     ",4,null,null,0,""]
["S",3,"S",0,1,1,6,0,0,0,0,"","Serviço","Serviço","-","SINAPI",97644,"REMOÇÃO DE PORTAS, DE FORMA MANUAL, SEM REAPROVEITAMENTO. AF_12/2017","M2",8.4,null,null,0,"Referência: AGETOP - 20106"]
["S",3,"S",0,1,1,6,0,0,0,0,"","Serviço","Serviço","-","SINAPI",97645,"REMOÇÃO DE JANELAS, DE FORMA MANUAL, SEM REAPROVEITAMENTO. AF_12/2017","M2",7.7999999999999989,null,null,0,"Referência: AGETOP - 20106"]
["S",3,"S",0,1,1,6,0,0,0,0,"","Serviço","Serviço","-","AGETOP",20109,"DEM.PISO CIMENT.SOBRE LASTRO CONC.C/TR.ATE CB. E CARGA","m2    ",80.2,null,null,0,""]
["S",3,"S",0,1,1,6,0,0,0,0,"","Serviço","Serviço","-","SINAPI",97633,"DEMOLIÇÃO DE REVESTIMENTO CERÂMICO, DE FORMA MANUAL, SEM REAPROVEITAMENTO. AF_12/2017","M2",94.1,null,null,0,"Referência: AGETOP - 20115"]
[3,3,3,2,1,1,7,0,0,4,2,"","Nível 3","Nível 3","-","SINAPI",null,"PISO PATIO COBERTO","-",null,null,null,0,""]
["S",3,"S",0,1,1,7,0,0,0,0,"","Serviço","Serviço","-","AGETOP",20121,"DEM. MANUAL EM CONCR.SIMPLES C/TR.ATE CB.E CARGA (O.C.)","m3    ",14.852000000000002,null,null,0,""]
[3,{"$f":"IF(OR(C62=\"s\",C62=0),OFFSET(B62,-1,0),C62)","v":3},{"$f":"IF(OFFSET(C62,-1,0)=\"L\",1,IF(OFFSET(C62,-1,0)=1,2,IF(OR(A62=\"s\",A62=0),\"S\",IF(AND(OFFSET(C62,-1,0)=2,A62=4),3,IF(AND(OR(OFFSET(C62,-1,0)=\"s\",OFFSET(C62,-1,0)=0),A62<>\"s\",A62>OFFSET(B62,-1,0)),OFFSET(B62,-1,0),A62)))))","v":3},{"$f":"IF(OR(C62=\"S\",C62=0),0,IF(ISERROR(K62),J62,SMALL(J62:K62,1)))","v":2},1,1,8,0,0,2,{"$error":"#N/A"},"","Nível 3","Nível 3","-","SINAPI",null,"REFORMA GERAL","-",null,null,null,0,""]
["S",3,"S",0,1,1,8,0,0,0,0,"","Serviço","Serviço","-","SINAPI","74209/1","PLACA DE OBRA EM CHAPA DE ACO GALVANIZADO","M2",7.5,null,null,0,"Referência: AGETOP - 21301"]
[2,2,2,3,1,2,0,0,0,367,3,"","Nível 2","Nível 2","-","AGETOP",null,"TRANSPORTES","-",null,null,null,0,""]
["S",2,"S",0,1,2,0,0,0,0,0,"","Serviço","Serviço","-","SINAPI",72900,"TRANSPORTE DE ENTULHO COM CAMINHAO BASCULANTE 6 M3, RODOVIA PAVIMENTADA, DMT 0,5 A 1,0 KM","M3",235.4024,null,null,0,""]
["S",{"$f":"IF(OR(C66=\"s\",C66=0),OFFSET(B66,-1,0),C66)","v":2},{"$f":"IF(OFFSET(C66,-1,0)=\"L\",1,IF(OFFSET(C66,-1,0)=1,2,IF(OR(A66=\"s\",A66=0),\"S\",IF(AND(OFFSET(C66,-1,0)=2,A66=4),3,IF(AND(OR(OFFSET(C66,-1,0)=\"s\",OFFSET(C66,-1,0)=0),A66<>\"s\",A66>OFFSET(B66,-1,0)),OFFSET(B66,-1,0),A66)))))","v":"S"},{"$f":"IF(OR(C66=\"S\",C66=0),0,IF(ISERROR(K66),J66,SMALL(J66:K66,1)))","v":0},{"$f":"IF($C66=1,OFFSET(E66,-1,0)+1,OFFSET(E66,-1,0))","v":1},{"$f":"IF($C66=1,0,IF($C66=2,OFFSET(F66,-1,0)+1,OFFSET(F66,-1,0)))","v":2},{"$f":"IF(AND($C66<=2,$C66<>0),0,IF($C66=3,OFFSET(G66,-1,0)+1,OFFSET(G66,-1,0)))","v":0},{"$f":"IF(AND($C66<=3,$C66<>0),0,IF($C66=4,OFFSET(H66,-1,0)+1,OFFSET(H66,-1,0)))","v":0},0,0,0,{"$f":"IF(OR(W66>0,$C66=1),\"F\",\"\")","v":""},"Serviço","Serviço","-","SINAPI",72898,"CARGA E DESCARGA MECANIZADAS DE ENTULHO EM CAMINHAO BASCULANTE 6 M3","M3",235.4024,null,null,0,"Referência: AGETOP - 41005"]
[2,2,2,11,1,3,0,0,0,364,11,"","Nível 2","Nível 2","-","AGETOP",null,"SERVIÇO EM TERRA","-",null,null,null,0,""]
[3,3,3,2,1,3,1,0,0,10,2,"","Nível 3","Nível 3","-","SINAPI",null,"ACESSIBILIDADE CALÇADA","-",null,null,null,0,""]
["S",3,"S",0,1,3,1,0,0,0,0,"","Serviço","Serviço","-","AGETOP",41002,"APILOAMENTO","m2    ",1900.85,null,null,0,""]
[3,3,3,3,1,3,2,0,0,8,3,"","Nível 3","Nível 3","-","SINAPI",null,"BANHEIROS / VESTIÁRIOS","-",null,null,null,0,""]
["S",3,"S",0,1,3,2,0,0,0,0,"","Serviço","Serviço","-","SINAPI",93358,"ESCAVAÇÃO MANUAL DE VALA COM PROFUNDIDADE MENOR OU IGUAL A 1,30 M. AF_03/2016","M3",20.7,null,null,0,"Referência: AGETOP - 40101"]
["S",3,"S",0,1,3,2,0,0,0,0,"","Serviço","Serviço","-","SINAPI",96995,"REATERRO MANUAL APILOADO COM SOQUETE. AF_10/2017","M3",20.7,null,null,0,"Referência: AGETOP - 40902"]
[3,3,3,2,1,3,3,0,0,5,2,"","Nível 3","Nível 3","-","SINAPI",null,"COBERTURA BLOCO 5","-",null,null,null,0,""]
["S",3,"S",0,1,3,3,0,0,0,0,"","Serviço","Serviço","-","AGETOP",20190,"LIMPEZA MECANICA DE TERRENO","m2    ",188.83,null,null,0,""]
[3,3,3,3,1,3,4,0,0,3,{"$error":"#N/A"},"","Nível 3","Nível 3","-","SINAPI",null,"COBERTURA BLOCO 5","-",null,null,null,0,""]
["S",3,"S",0,1,3,4,0,0,0,0,"","Serviço","Serviço","-","AGETOP",41002,"APILOAMENTO","m2    ",188.83,null,null,0,""]
["S",3,"S",0,1,3,4,0,0,0,0,"","Serviço","Serviço","-","AGETOP",41003,"ATERRO INTERNO SEM APILOAM.C/TR.EM CARRINHO MÃO","m3    ",188.83,null,null,0,""]
[{"$f":"CHOOSE(1+LOG(1+2*(ORÇAMENTO.Nivel=\"Nível 1\")+4*(ORÇAMENTO.Nivel=\"Nível 2\")+8*(ORÇAMENTO.Nivel=\"Nível 3\")+16*(ORÇAMENTO.Nivel=\"Nível 4\")+32*(ORÇAMENTO.Nivel=\"Serviço\"),2),0,1,2,3,4,\"S\")","v":2},{"$f":"IF(OR(C78=\"s\",C78=0),OFFSET(B78,-1,0),C78)","v":2},{"$f":"IF(OFFSET(C78,-1,0)=\"L\",1,IF(OFFSET(C78,-1,0)=1,2,IF(OR(A78=\"s\",A78=0),\"S\",IF(AND(OFFSET(C78,-1,0)=2,A78=4),3,IF(AND(OR(OFFSET(C78,-1,0)=\"s\",OFFSET(C78,-1,0)=0),A78<>\"s\",A78>OFFSET(B78,-1,0)),OFFSET(B78,-1,0),A78)))))","v":2},{"$f":"IF(OR(C78=\"S\",C78=0),0,IF(ISERROR(K78),J78,SMALL(J78:K78,1)))","v":13},{"$f":"IF($C78=1,OFFSET(E78,-1,0)+1,OFFSET(E78,-1,0))","v":1},{"$f":"IF($C78=1,0,IF($C78=2,OFFSET(F78,-1,0)+1,OFFSET(F78,-1,0)))","v":4},{"$f":"IF(AND($C78<=2,$C78<>0),0,IF($C78=3,OFFSET(G78,-1,0)+1,OFFSET(G78,-1,0)))","v":0},{"$f":"IF(AND($C78<=3,$C78<>0),0,IF($C78=4,OFFSET(H78,-1,0)+1,OFFSET(H78,-1,0)))","v":0},{"$f":"IF(AND($C78<=4,$C78<>0),0,IF(AND($C78=\"S\",$W78>0),OFFSET(I78,-1,0)+1,OFFSET(I78,-1,0)))","v":0},353,13,{"$f":"IF(OR(W78>0,$C78=1),\"F\",\"\")","v":""},"Nível 2","Nível 2","-","AGETOP",null,"FUNDAÇÕES E SONDAGENS","-",null,null,null,0,""]
[3,3,3,4,1,4,1,0,0,12,4,"","Nível 3","Nível 3","-","AGETOP",null,"ESTACAS","-",null,null,null,0,""]
["S",3,"S",0,1,4,1,0,0,0,0,"","Serviço","Serviço","-","AGETOP",52004,"ACO CA 50-A - 8,0 MM (5/16\") - (OBRAS CIVIS)","Kg    ",315,null,null,0,""]
[{"$f":"CHOOSE(1+LOG(1+2*(ORÇAMENTO.Nivel=\"Nível 1\")+4*(ORÇAMENTO.Nivel=\"Nível 2\")+8*(ORÇAMENTO.Nivel=\"Nível 3\")+16*(ORÇAMENTO.Nivel=\"Nível 4\")+32*(ORÇAMENTO.Nivel=\"Serviço\"),2),0,1,2,3,4,\"S\")","v":"S"},3,"S",0,1,4,1,0,{"$f":"IF(AND($C81<=4,$C81<>0),0,IF(AND($C81=\"S\",$W81>0),OFFSET(I81,-1,0)+1,OFFSET(I81,-1,0)))","v":0},0,0,"","Serviço","Serviço","-","AGETOP",52014,"ACO CA-60 - 5,0 MM - (OBRAS CIVIS)","Kg    ",180.18181818181816,null,null,0,""]
["S",3,"S",0,1,4,1,0,0,0,0,"","Serviço","Serviço","-","AGETOP",50302,"ESTACA A TRADO DIAM.30 CM SEM FERRO","M     ",163,null,null,0,""]
[3,3,3,8,1,4,2,0,0,{"$f":"IF(OR($C83=\"S\",$C83=0),0,MATCH(0,OFFSET($D83,1,$C83,ROW($C$431)-ROW($C83)),0))","v":8},{"$f":"IF(OR($C83=\"S\",$C83=0),0,MATCH(OFFSET($D83,0,$C83)+1,OFFSET($D83,1,$C83,ROW($C$431)-ROW($C83)),0))","v":195},"","Nível 3","Nível 3","-","SINAPI",null,"BLOCOS","-",null,null,null,0,""]
["S",3,"S",0,1,4,2,0,0,0,0,"","Serviço","Serviço","-","AGETOP",52004,"ACO CA 50-A - 8,0 MM (5/16\") - (OBRAS CIVIS)","Kg    ",7.2727272727272725,null,null,0,""]
["S",3,"S",0,1,4,2,0,0,0,0,"","Serviço","Serviço","-","AGETOP",52005,"ACO CA-50A - 10,0 MM (3/8\") - (OBRAS CIVIS)","Kg    ",269.45454545454544,null,null,0,""]
["S",3,"S",0,1,4,2,0,0,0,0,"","Serviço","Serviço","-","AGETOP",52006,"ACO CA 50-A - 12,5 MM (1/2\") - (OBRAS CIVIS)","Kg    ",4.3636363636363633,null,null,0,""]
["S",3,"S",0,1,4,2,0,0,0,0,"","Serviço","Serviço","-","AGETOP",52014,"ACO CA-60 - 5,0 MM - (OBRAS CIVIS)","Kg    ",389.36363636363632,null,null,0,""]
["S",3,"S",0,1,4,2,0,0,0,0,"","Serviço","Serviço","-","AGETOP",51009,"FORMA TABUA PINHO P/FUNDACOES U=3V - (OBRAS CIVIS)","m2    ",175.56,null,null,0,""]
["S",3,"S",0,1,4,2,0,0,0,0,"","Serviço","Serviço","-","AGETOP",51030,"PREPARO COM BETONEIRA E TRANSPORTE MANUAL DE CONCRETO FCK=25 MPA","m3    ",25.61,null,null,0,""]
["S",{"$f":"IF(OR(C90=\"s\",C90=0),OFFSET(B90,-1,0),C90)","v":3},{"$f":"IF(OFFSET(C90,-1,0)=\"L\",1,IF(OFFSET(C90,-1,0)=1,2,IF(OR(A90=\"s\",A90=0),\"S\",IF(AND(OFFSET(C90,-1,0)=2,A90=4),3,IF(AND(OR(OFFSET(C90,-1,0)=\"s\",OFFSET(C90,-1,0)=0),A90<>\"s\",A90>OFFSET(B90,-1,0)),OFFSET(B90,-1,0),A90)))))","v":"S"},{"$f":"IF(OR(C90=\"S\",C90=0),0,IF(ISERROR(K90),J90,SMALL(J90:K90,1)))","v":0},{"$f":"IF($C90=1,OFFSET(E90,-1,0)+1,OFFSET(E90,-1,0))","v":1},{"$f":"IF($C90=1,0,IF($C90=2,OFFSET(F90,-1,0)+1,OFFSET(F90,-1,0)))","v":4},{"$f":"IF(AND($C90<=2,$C90<>0),0,IF($C90=3,OFFSET(G90,-1,0)+1,OFFSET(G90,-1,0)))","v":2},{"$f":"IF(AND($C90<=3,$C90<>0),0,IF($C90=4,OFFSET(H90,-1,0)+1,OFFSET(H90,-1,0)))","v":0},0,0,0,{"$f":"IF(OR(W90>0,$C90=1),\"F\",\"\")","v":""},"Serviço","Serviço","-","AGETOP",60801,"LANÇAMENTO/APLICAÇÃO/ADENSAMENTO MANUAL DE CONCRETO - (OBRAS CIVIS)","m3    ",25.61,null,null,0,""]
[2,2,2,17,1,5,0,0,0,340,17,"","Nível 2","Nível 2","-","AGETOP",null,"ESTRUTURA","-",null,null,null,0,""]
[3,3,3,7,1,5,1,0,0,16,7,"","Nível 3","Nível 3","-","AGETOP",null,"PILARES","-",null,null,null,0,""]
["S",3,"S",0,1,5,1,0,0,0,0,"","Serviço","Serviço","-","AGETOP",60305,"ACO CA-50A - 10,0 MM (3/8\") - (OBRAS CIVIS)","Kg    ",842.72727272727263,null,null,0,""]
["S",3,"S",0,1,5,1,0,0,0,0,"","Serviço","Serviço","-","AGETOP",60306,"ACO CA-50A - 12,5 MM (1/2\") - (OBRAS CIVIS)","Kg    ",14.454545454545453,null,null,0,""]
["S",3,"S",0,1,5,1,0,0,0,0,"","Serviço","Serviço","-","AGETOP",60314,"ACO CA - 60 - 5,0 MM - (OBRAS CIVIS)","Kg    ",332.72727272727269,null,null,0,""]
["S",3,"S",0,1,5,1,0,0,0,0,"","Serviço","Serviço","-","AGETOP",51030,"PREPARO COM BETONEIRA E TRANSPORTE MANUAL DE CONCRETO FCK=25 MPA","m3    ",12.93,null,null,0,""]
["S",3,"S",0,1,5,1,0,0,0,0,"","Serviço","Serviço","-","AGETOP",60801,"LANÇAMENTO/APLICAÇÃO/ADENSAMENTO MANUAL DE CONCRETO - (OBRAS CIVIS)","m3    ",12.93,null,null,0,""]
["S",3,"S",0,1,5,1,0,0,0,0,"","Serviço","Serviço","-","AGETOP",60209,"FORMA CH.COMPENSADA 12MM-VIGA/PILAR U=4V - (OBRAS CIVIS","m2    ",275.85000000000002,null,null,0,""]
[3,3,3,9,1,5,2,0,0,9,179,"","Nível 3","Nível 3","-",null,null,"VIGAS DE COBERTURA","-",null,null,null,0,""]
["S",3,"S",0,1,5,2,0,0,0,0,"","Serviço","Serviço","-","AGETOP",60303,"ACO CA-50-A - 6,3 MM (1/4\") - (OBRAS CIVIS)","Kg    ",1.3636363636363635,null,null,0,""]
["S",3,"S",0,1,5,2,0,0,0,0,"","Serviço","Serviço","-","AGETOP",60304,"ACO CA-50 A - 8,0 MM (5/16\") - (OBRAS CIVIS)","Kg    ",335.90909090909082,null,null,0,""]
["S",3,"S",0,1,5,2,0,0,0,0,"","Serviço","Serviço","-","AGETOP",60305,"ACO CA-50A - 10,0 MM (3/8\") - (OBRAS CIVIS)","Kg    ",666.36363636363626,null,null,0,""]
["S",3,"S",0,1,5,2,0,0,0,0,"","Serviço","Serviço","-","AGETOP",60306,"ACO CA-50A - 12,5 MM (1/2\") - (OBRAS CIVIS)","Kg    ",39.454545454545453,null,null,0,""]
["S",3,"S",0,1,5,2,0,0,0,0,"","Serviço","Serviço","-","AGETOP",60314,"ACO CA - 60 - 5,0 MM - (OBRAS CIVIS)","Kg    ",534.45454545454538,null,null,0,""]
["S",3,"S",0,1,5,2,0,0,0,0,"","Serviço","Serviço","-","AGETOP",60517,"PREPARO COM BETONEIRA E TRANSPORTE MANUAL DE CONCRETO FCK=25 MPA ","m3    ",44.03,null,null,0,""]
["S",3,"S",0,1,5,2,0,0,0,0,"","Serviço","Serviço","-","AGETOP",60801,"LANÇAMENTO/APLICAÇÃO/ADENSAMENTO MANUAL DE CONCRETO - (OBRAS CIVIS)","m3    ",44.03,null,null,0,""]
["S",{"$f":"IF(OR(C107=\"s\",C107=0),OFFSET(B107,-1,0),C107)","v":3},{"$f":"IF(OFFSET(C107,-1,0)=\"L\",1,IF(OFFSET(C107,-1,0)=1,2,IF(OR(A107=\"s\",A107=0),\"S\",IF(AND(OFFSET(C107,-1,0)=2,A107=4),3,IF(AND(OR(OFFSET(C107,-1,0)=\"s\",OFFSET(C107,-1,0)=0),A107<>\"s\",A107>OFFSET(B107,-1,0)),OFFSET(B107,-1,0),A107)))))","v":"S"},{"$f":"IF(OR(C107=\"S\",C107=0),0,IF(ISERROR(K107),J107,SMALL(J107:K107,1)))","v":0},{"$f":"IF($C107=1,OFFSET(E107,-1,0)+1,OFFSET(E107,-1,0))","v":1},{"$f":"IF($C107=1,0,IF($C107=2,OFFSET(F107,-1,0)+1,OFFSET(F107,-1,0)))","v":5},{"$f":"IF(AND($C107<=2,$C107<>0),0,IF($C107=3,OFFSET(G107,-1,0)+1,OFFSET(G107,-1,0)))","v":2},{"$f":"IF(AND($C107<=3,$C107<>0),0,IF($C107=4,OFFSET(H107,-1,0)+1,OFFSET(H107,-1,0)))","v":0},0,0,0,{"$f":"IF(OR(W107>0,$C107=1),\"F\",\"\")","v":""},"Serviço","Serviço","-","AGETOP",60209,"FORMA CH.COMPENSADA 12MM-VIGA/PILAR U=4V - (OBRAS CIVIS","m2    ",517.17999999999995,null,null,0,""]
[{"$f":"CHOOSE(1+LOG(1+2*(ORÇAMENTO.Nivel=\"Nível 1\")+4*(ORÇAMENTO.Nivel=\"Nível 2\")+8*(ORÇAMENTO.Nivel=\"Nível 3\")+16*(ORÇAMENTO.Nivel=\"Nível 4\")+32*(ORÇAMENTO.Nivel=\"Serviço\"),2),0,1,2,3,4,\"S\")","v":2},{"$f":"IF(OR(C108=\"s\",C108=0),OFFSET(B108,-1,0),C108)","v":2},{"$f":"IF(OFFSET(C108,-1,0)=\"L\",1,IF(OFFSET(C108,-1,0)=1,2,IF(OR(A108=\"s\",A108=0),\"S\",IF(AND(OFFSET(C108,-1,0)=2,A108=4),3,IF(AND(OR(OFFSET(C108,-1,0)=\"s\",OFFSET(C108,-1,0)=0),A108<>\"s\",A108>OFFSET(B108,-1,0)),OFFSET(B108,-1,0),A108)))))","v":2},{"$f":"IF(OR(C108=\"S\",C108=0),0,IF(ISERROR(K108),J108,SMALL(J108:K108,1)))","v":118},{"$f":"IF($C108=1,OFFSET(E108,-1,0)+1,OFFSET(E108,-1,0))","v":1},{"$f":"IF($C108=1,0,IF($C108=2,OFFSET(F108,-1,0)+1,OFFSET(F108,-1,0)))","v":6},{"$f":"IF(AND($C108<=2,$C108<>0),0,IF($C108=3,OFFSET(G108,-1,0)+1,OFFSET(G108,-1,0)))","v":0},{"$f":"IF(AND($C108<=3,$C108<>0),0,IF($C108=4,OFFSET(H108,-1,0)+1,OFFSET(H108,-1,0)))","v":0},{"$f":"IF(AND($C108<=4,$C108<>0),0,IF(AND($C108=\"S\",$W108>0),OFFSET(I108,-1,0)+1,OFFSET(I108,-1,0)))","v":0},323,118,{"$f":"IF(OR(W108>0,$C108=1),\"F\",\"\")","v":""},"Nível 2","Nível 2","-",null,null,"INSTALAÇÕES ELÉTRICAS","-",null,null,null,0,""]
[3,{"$f":"IF(OR(C109=\"s\",C109=0),OFFSET(B109,-1,0),C109)","v":3},{"$f":"IF(OFFSET(C109,-1,0)=\"L\",1,IF(OFFSET(C109,-1,0)=1,2,IF(OR(A109=\"s\",A109=0),\"S\",IF(AND(OFFSET(C109,-1,0)=2,A109=4),3,IF(AND(OR(OFFSET(C109,-1,0)=\"s\",OFFSET(C109,-1,0)=0),A109<>\"s\",A109>OFFSET(B109,-1,0)),OFFSET(B109,-1,0),A109)))))","v":3},{"$f":"IF(OR(C109=\"S\",C109=0),0,IF(ISERROR(K109),J109,SMALL(J109:K109,1)))","v":66},{"$f":"IF($C109=1,OFFSET(E109,-1,0)+1,OFFSET(E109,-1,0))","v":1},{"$f":"IF($C109=1,0,IF($C109=2,OFFSET(F109,-1,0)+1,OFFSET(F109,-1,0)))","v":6},{"$f":"IF(AND($C109<=2,$C109<>0),0,IF($C109=3,OFFSET(G109,-1,0)+1,OFFSET(G109,-1,0)))","v":1},{"$f":"IF(AND($C109<=3,$C109<>0),0,IF($C109=4,OFFSET(H109,-1,0)+1,OFFSET(H109,-1,0)))","v":0},0,117,66,{"$f":"IF(OR(W109>0,$C109=1),\"F\",\"\")","v":""},"Nível 3","Nível 3","-","SINAPI",null,"SUBESTAÇÃO 150 KVA","-",null,null,null,0,""]
["S",3,"S",0,1,6,1,0,0,0,0,"","Serviço","Serviço","-","SINAPI","73767/2","ALCA PRE-FORMADA DISTRIBUIÇÃO EM  ACO RECOBERTO COM ALUMINIO PARA CABO 25MM2, ENCAPADO. FORNECIMENTO E INSTALAÇÃO.","UN",1,null,null,0,""]
["S",3,"S",0,1,6,1,0,0,0,0,"","Serviço","Serviço","-","AGETOP",70252,"ARRUELA LISA D=5/16\"","Un    ",8,null,null,0,""]
["S",3,"S",0,1,6,1,0,0,0,0,"","Serviço","Serviço","-","AGETOP",70268,"BARRA DE COBRE 2\" X 3/16\"  (2,0865 KG/M)","m     ",1.5,null,null,0,""]
["S",3,"S",0,1,6,1,0,0,0,0,"","Serviço","Serviço","-","SINAPI",91175,"FIXAÇÃO DE TUBOS VERTICAIS DE PPR DIÂMETROS MAIORES QUE 75 MM COM ABRAÇADEIRA METÁLICA RÍGIDA TIPO D 3\", FIXADA EM PERFILADO EM ALVENARIA. AF_05/2015","M",6,null,null,0,""]
["S",3,"S",0,1,6,1,0,0,0,0,"","Serviço","Serviço","-","AGETOP",70386,"BRAÇO C AÇO GALVANIZADO , CONFORME NTD-17","un    ",1,null,null,0,""]
["S",3,"S",0,1,6,1,0,0,0,0,"","Serviço","Serviço","-","AGETOP",70422,"BUCHA E ARRUELA METALICA DIAM. 1\"","PR    ",4,null,null,0,""]
["S",3,"S",0,1,6,1,0,0,0,0,"","Serviço","Serviço","-","AGETOP",70428,"BUCHA E ARRUELA METALICA DIAM. 4\"","PR    ",3,null,null,0,""]
["S",3,"S",0,1,6,1,0,0,0,0,"","Serviço","Serviço","-","SINAPI",92980,"CABO DE COBRE FLEXÍVEL ISOLADO, 10 MM², ANTI-CHAMA 0,6/1,0 KV, PARA DISTRIBUIÇÃO - FORNECIMENTO E INSTALAÇÃO. AF_12/2015","M",5,null,null,0,""]
["S",3,"S",0,1,6,1,0,0,0,0,"","Serviço","Serviço","-","SINAPI",92992,"CABO DE COBRE FLEXÍVEL ISOLADO, 95 MM², ANTI-CHAMA 0,6/1,0 KV, PARA DISTRIBUIÇÃO - FORNECIMENTO E INSTALAÇÃO. AF_12/2015","M",60,null,null,0,""]
["S",3,"S",0,1,6,1,0,0,0,0,"","Serviço","Serviço","-","SINAPI",92996,"CABO DE COBRE FLEXÍVEL ISOLADO, 150 MM², ANTI-CHAMA 0,6/1,0 KV, PARA DISTRIBUIÇÃO - FORNECIMENTO E INSTALAÇÃO. AF_12/2015","M",220,null,null,0,""]
["S",3,"S",0,1,6,1,0,0,0,0,"","Serviço","Serviço","-","AGETOP",70543,"CABO DE COBRE NÚ No. 35 MM2","M     ",3,null,null,0,""]
["S",3,"S",0,1,6,1,0,0,0,0,"","Serviço","Serviço","-","SINAPI",96977,"CORDOALHA DE COBRE NU 50 MM², ENTERRADA, SEM ISOLADOR - FORNECIMENTO E INSTALAÇÃO. AF_12/2017","M",45,null,null,0,""]
["S",3,"S",0,1,6,1,0,0,0,0,"","Serviço","Serviço","-","AGETOP",70696,"CAIXA METÁLICA PARA PROTEÇÃO GERAL 820X750X266MM DE 250A A 350A","Un    ",1,null,null,0,""]
["S",3,"S",0,1,6,1,0,0,0,0,"","Serviço","Serviço","-","AGETOP",70697,"CAIXA METÁLICA PARA T.C. 820X750X266MM - 250 A 350A","Un    ",1,null,null,0,""]
[{"$f":"CHOOSE(1+LOG(1+2*(ORÇAMENTO.Nivel=\"Nível 1\")+4*(ORÇAMENTO.Nivel=\"Nível 2\")+8*(ORÇAMENTO.Nivel=\"Nível 3\")+16*(ORÇAMENTO.Nivel=\"Nível 4\")+32*(ORÇAMENTO.Nivel=\"Serviço\"),2),0,1,2,3,4,\"S\")","v":"S"},3,"S",0,1,6,1,0,{"$f":"IF(AND($C124<=4,$C124<>0),0,IF(AND($C124=\"S\",$W124>0),OFFSET(I124,-1,0)+1,OFFSET(I124,-1,0)))","v":0},0,0,"","Serviço","Serviço","-","SINAPI",97893,"CAIXA ENTERRADA ELÉTRICA RETANGULAR, EM ALVENARIA COM BLOCOS DE CONCRETO, FUNDO COM BRITA, DIMENSÕES INTERNAS: 0,8X0,8X0,6 M. AF_05/2018","UN",1,null,null,0,""]
["S",3,"S",0,1,6,1,0,0,0,0,"","Serviço","Serviço","-","AGETOP",70771,"CANTONEIRA AUXILIAR PARA BRAÇO TIPO C","un    ",1,null,null,0,""]
["S",3,"S",0,1,6,1,0,0,0,0,{"$f":"IF(OR(W126>0,$C126=1),\"F\",\"\")","v":""},"Serviço","Serviço","-","AGETOP",70920,"CINTA DE ACO GALVANIZADO DIAM.190 MM","Un    ",1,null,null,0,""]
["S",3,"S",0,{"$f":"IF($C127=1,OFFSET(E127,-1,0)+1,OFFSET(E127,-1,0))","v":1},{"$f":"IF($C127=1,0,IF($C127=2,OFFSET(F127,-1,0)+1,OFFSET(F127,-1,0)))","v":6},{"$f":"IF(AND($C127<=2,$C127<>0),0,IF($C127=3,OFFSET(G127,-1,0)+1,OFFSET(G127,-1,0)))","v":1},{"$f":"IF(AND($C127<=3,$C127<>0),0,IF($C127=4,OFFSET(H127,-1,0)+1,OFFSET(H127,-1,0)))","v":0},0,0,0,"","Serviço","Serviço","-","AGETOP",70921,"CINTA DE ACO GALVANIZADO DIAM.220 MM","Un    ",2,null,null,0,""]
["S",3,"S",0,1,6,1,0,0,0,0,"","Serviço","Serviço","-","AGETOP",70922,"CINTA DE ACO GALVANIZADO DIAM.230MM","Un    ",2,null,null,0,""]
["S",3,"S",0,1,6,1,0,0,0,0,"","Serviço","Serviço","-","AGETOP",71016,"CONECTOR DE COMPRESSÃO FORMATO H PARA CABO 25 A 70 MM2","un    ",4,null,null,0,""]
["S",3,"S",0,1,6,1,0,0,0,0,"","Serviço","Serviço","-","AGETOP",71020,"CONECTOR PARAL. ALUM.EXTRUD.CA-CU-10,0D.10-2-1 PARAF.","Un    ",6,null,null,0,""]
["S",3,"S",0,1,6,1,0,0,0,0,"","Serviço","Serviço","-","SINAPI",72272,"CONECTOR PARAFUSO FENDIDO \u0094SPLIT-BOLT\u0094 - PARA CABO DE 35MM2 - FORNECIMENTO E INSTALACAO","UN",1,null,null,0,""]
["S",3,"S",0,1,6,1,0,0,0,0,"","Serviço","Serviço","-","AGETOP",71040,"CONECTOR TIPO PARAFUSO FENDIDO 150 MM2","Un    ",4,null,null,0,""]
["S",{"$f":"IF(OR(C133=\"s\",C133=0),OFFSET(B133,-1,0),C133)","v":3},{"$f":"IF(OFFSET(C133,-1,0)=\"L\",1,IF(OFFSET(C133,-1,0)=1,2,IF(OR(A133=\"s\",A133=0),\"S\",IF(AND(OFFSET(C133,-1,0)=2,A133=4),3,IF(AND(OR(OFFSET(C133,-1,0)=\"s\",OFFSET(C133,-1,0)=0),A133<>\"s\",A133>OFFSET(B133,-1,0)),OFFSET(B133,-1,0),A133)))))","v":"S"},{"$f":"IF(OR(C133=\"S\",C133=0),0,IF(ISERROR(K133),J133,SMALL(J133:K133,1)))","v":0},1,6,1,0,0,0,0,"","Serviço","Serviço","-","AGETOP",71142,"CURVA DE 90 GRAUS DE PVC RIGIDO DIAM. 1\"","Un    ",1,null,null,0,""]
["S",3,"S",0,1,6,1,0,0,0,0,"","Serviço","Serviço","-","SINAPI",93026,"CURVA 90 GRAUS PARA ELETRODUTO, PVC, ROSCÁVEL, DN 110 MM (4\") - FORNECIMENTO E INSTALAÇÃO. AF_12/2015","UN",1,null,null,0,""]
["S",3,"S",0,1,6,1,0,0,0,0,"","Serviço","Serviço","-","AGETOP",71451,"INTERRUPTOR DIFERENCIAL RESIDUAL (D.R.) BIPOLAR DE 40A-30mA","Un    ",10,null,null,0,""]
["S",3,"S",0,1,6,1,0,0,0,0,"","Serviço","Serviço","-","AGETOP",71186,"DISPOSITIVO DE PROTEÇÃO CONTRA SURTOS (D.P.S.) 275V DE 90KA","Un    ",3,null,null,0,""]
["S",3,"S",0,1,6,1,0,0,0,0,"","Serviço","Serviço","-","SINAPI","74130/7","DISJUNTOR TERMOMAGNETICO TRIPOLAR EM CAIXA MOLDADA 250A 600V, FORNECIMENTO E INSTALACAO","UN",2,null,null,0,""]
["S",3,"S",0,1,6,1,0,0,0,0,"","Serviço","Serviço","-","AGETOP",71202,"ELETRODUTO DE PVC RIGIDO DIAMETRO 1\"","M     ",3,null,null,0,""]
["S",3,"S",0,1,6,1,0,0,0,0,"","Serviço","Serviço","-","SINAPI",93012,"ELETRODUTO RÍGIDO ROSCÁVEL, PVC, DN 110 MM (4\") - FORNECIMENTO E INSTALAÇÃO. AF_12/2015","M",55,null,null,0,""]
["S",3,"S",0,1,6,1,0,0,0,0,"","Serviço","Serviço","-","AGETOP",71218,"ELETRODUTO EM AÇO GALVANIZADO A FOGO DIÂMETRO 4\" - PESADO ","M     ",7,null,null,0,""]
["S",3,"S",0,1,6,1,0,0,0,0,"","Serviço","Serviço","-","AGETOP",71268,"ELO FUSÍVEL 6 K","Un    ",1,null,null,0,""]
["S",3,"S",0,1,6,1,0,0,0,0,"","Serviço","Serviço","-","AGETOP",71321,"FITA DE AUTO FUSAO, ROLO E 10,00 MM","Un    ",5,null,null,0,""]
["S",3,"S",0,1,6,1,0,0,0,0,"","Serviço","Serviço","-","AGETOP",71365,"GRAMPO DE ANCORAGEM POLIMÉRICO","un    ",3,null,null,0,""]
["S",3,"S",0,1,6,1,0,0,0,0,"","Serviço","Serviço","-","AGETOP",71381,"HASTE REV.COBRE(COPPERWELD)  5/8\" X 3,00 M C/CONECTOR","Un    ",9,null,null,0,""]
["S",3,"S",0,1,6,1,0,0,0,0,"","Serviço","Serviço","-","AGETOP",70255,"ATERRAMENTO - SOLDA EXOTÉRMICA - CARTUCHO 90 G","un    ",9,null,null,0,""]
["S",3,"S",0,1,6,1,0,0,0,0,"","Serviço","Serviço","-","AGETOP",71463,"ISOLADOR EPOXI 50X40 (BUJAO)","Un    ",3,null,null,0,""]
["S",3,"S",0,1,6,1,0,0,{"$f":"IF(OR($C147=\"S\",$C147=0),0,MATCH(0,OFFSET($D147,1,$C147,ROW($C$431)-ROW($C147)),0))","v":0},{"$f":"IF(OR($C147=\"S\",$C147=0),0,MATCH(OFFSET($D147,0,$C147)+1,OFFSET($D147,1,$C147,ROW($C$431)-ROW($C147)),0))","v":0},"","Serviço","Serviço","-","AGETOP",71476,"ISOLADOR DE ANCORAGEM POLIMÉRICO 15KV","un    ",1,null,null,0,""]
["S",3,"S",0,1,6,1,0,0,0,0,"","Serviço","Serviço","-","AGETOP",71510,"LACO PREFORMADO DE DISTRIBUICAO","Un    ",1,null,null,0,""]
["S",3,"S",0,1,6,1,0,0,0,0,"","Serviço","Serviço","-","AGETOP",71742,"LUVA PVC ROSQUEAVEL DIAMETRO 1\"","Un    ",1,null,null,0,""]
["S",3,"S",0,1,6,1,0,0,0,0,"","Serviço","Serviço","-","SINAPI",93017,"LUVA PARA ELETRODUTO, PVC, ROSCÁVEL, DN 110 MM (4\") - FORNECIMENTO E INSTALAÇÃO. AF_12/2015","UN",27.5,null,null,0,"Referência: AGETOP - 71748"]
["S",3,"S",0,1,6,1,0,0,0,0,"","Serviço","Serviço","-","AGETOP",71708,"LUVA EM AÇO GALVANIZADO DIÂMETRO 4\"","Un    ",4,null,null,0,""]
["S",3,"S",0,1,6,1,0,0,0,0,"","Serviço","Serviço","-","AGETOP",71750,"MANILHA-SAPATILHA EM AÇO GALVANIZADO","un    ",1,null,null,0,""]
["S",3,"S",0,1,6,1,0,0,0,0,"","Serviço","Serviço","-","AGETOP",71761,"MURETA MEDIÇÃO ALVEN. 1 1/2 V.(35CM) REBOC.C/PINTURA ACRÍL. E LAJE CONC. 20MPA MALHA 8.0MM CADA 10CM REVEST.C/ARGAMASSA 1:3 C/ IMPERMEABILIZANTE","m2    ",4,null,null,0,""]
["S",3,"S",0,1,6,1,0,0,0,0,"","Serviço","Serviço","-","AGETOP",71773,"NIPLE METALICO Fo.Zo. DIAMETRO 1\"","Un    ",1,null,null,0,""]
["S",3,"S",0,1,6,1,0,0,0,0,"","Serviço","Serviço","-","AGETOP",71780,"NIPLE METALICO Fo.Zo. DIAMETRO 4\"","Un    ",2,null,null,0,""]
["S",3,"S",0,1,6,1,0,0,0,0,"","Serviço","Serviço","-","AGETOP",85047,"NIPLE DUPLO FERRO GALVANIZADO 2.1/2\"","Un    ",1,null,null,0,""]
["S",3,"S",0,1,6,1,0,0,0,0,"","Serviço","Serviço","-","AGETOP",71795,"OLHAL PARA PARAFUSO","un    ",3,null,null,0,""]
["S",3,"S",0,1,6,1,0,0,0,0,"","Serviço","Serviço","-","AGETOP",71835,"PARAFUSO CABEÇA ABAULADA (FRANCES) M16 X 45 MM","Un    ",3,null,null,0,""]
["S",3,"S",0,1,6,1,0,0,0,0,"","Serviço","Serviço","-","AGETOP",71841,"PARAFUSO CABEÇA ABAULADA (FRANCES) M16 X 150 MM","Un    ",3,null,null,0,""]
["S",3,"S",0,1,6,1,0,0,0,0,"","Serviço","Serviço","-","AGETOP",71833,"PARA RAIOS DISTRIBUIDOR POLIMÉRICO ÓXIDO DE ZINCO S/CENTELHADOR C/ DESLIGAMENTO AUTOMÁTICO 15KV,10KA","Un    ",3,null,null,0,""]
["S",3,"S",0,1,6,1,0,0,0,0,"","Serviço","Serviço","-","AGETOP",71997,"POSTE - FUNDAÇÃO EM CONCRETO SIMPLES DA BASE DOS POSTES 11/600 PARA TRAFO ( DIAM. 1000MM)","m     ",0.3,null,null,0,""]
["S",3,"S",0,1,6,1,0,0,0,0,"","Serviço","Serviço","-","AGETOP",72061,"POSTE DE CONCRETO SC 11/600 - SEM FUNDAÇÃO/CONCRETO","Un    ",1,null,null,0,""]
["S",3,"S",0,1,6,1,0,0,0,0,"","Serviço","Serviço","-","AGETOP",72080,"POSTE/TRAFO - CAMINHÃO MUNCK 12 TON. (MÍNIMO 4H/DIA)","H     ",4,null,null,0,""]
["S",3,"S",0,1,6,1,0,0,0,0,"","Serviço","Serviço","-","AGETOP",72329,"SAPATILHA DE AÇO GALVANIZADO PARA POSTE COM TRANSFORMADOR","un    ",3,null,null,0,""]
["S",3,"S",0,1,6,1,0,0,0,0,"","Serviço","Serviço","-","SINAPI",73624,"SUPORTE PARA TRANSFORMADOR EM POSTE DE CONCRETO CIRCULAR","UN",2,null,null,0,""]
["S",3,"S",0,1,6,1,0,0,0,0,"","Serviço","Serviço","-","AGETOP",72518,"TERMINAL DE PRESSAO 10 MM2","Un    ",1,null,null,0,""]
["S",3,"S",0,1,6,1,0,0,0,0,"","Serviço","Serviço","-","AGETOP",72538,"TERMINAL DE PRESSAO 95 MM2","Un    ",2,null,null,0,""]
["S",3,"S",0,1,6,1,0,0,0,0,"","Serviço","Serviço","-","AGETOP",72550,"TERMINAL DE PRESSAO 150 MM2","Un    ",10,null,null,0,""]
["S",3,"S",0,1,6,1,0,0,0,0,"","Serviço","Serviço","-","SINAPI","73857/3","TRANSFORMADOR DISTRIBUICAO  150KVA TRIFASICO 60HZ CLASSE 15KV IMERSO EM ÓLEO MINERAL FORNECIMENTO E INSTALACAO","UN",1,null,null,0,""]
["S",3,"S",0,1,6,1,0,0,0,0,"","Serviço","Serviço","-","SINAPI",88543,"ARMACAO SECUNDARIA OU REX COMPLETA PARA TRESLINHAS-FORNECIMENTO E INSTALACAO.","UN",1,null,null,0,""]
["S",3,"S",0,1,6,1,0,0,0,0,"","Serviço","Serviço","-","COMPOSIÇÃO","COMP 046_SEE","CAPUZ PARA PROTEÇÃO DOS PARA RAIOS","UN ",3,null,null,0,""]
["S",3,"S",0,1,6,1,0,0,0,0,"","Serviço","Serviço","-","COMPOSIÇÃO","COMP 047_SEE","CAPUZ DE PROTEÇÃO PARA BUCHA DE TRANSFORMADOR","UN ",3,null,null,0,""]
["S",3,"S",0,1,6,1,0,0,0,0,"","Serviço","Serviço","-","COMPOSIÇÃO","COMP 048_SEE","HASTE ROSQUEADA \"TIRANTE\" 3/8\"","M",0.5,null,null,0,""]
["S",3,"S",0,1,6,1,0,0,0,0,"","Serviço","Serviço","-","COMPOSIÇÃO","COMP 049_SEE","PORCA SEXTAVADA 3/8\"","UN ",8,null,null,0,""]
[3,{"$f":"IF(OR(C175=\"s\",C175=0),OFFSET(B175,-1,0),C175)","v":3},{"$f":"IF(OFFSET(C175,-1,0)=\"L\",1,IF(OFFSET(C175,-1,0)=1,2,IF(OR(A175=\"s\",A175=0),\"S\",IF(AND(OFFSET(C175,-1,0)=2,A175=4),3,IF(AND(OR(OFFSET(C175,-1,0)=\"s\",OFFSET(C175,-1,0)=0),A175<>\"s\",A175>OFFSET(B175,-1,0)),OFFSET(B175,-1,0),A175)))))","v":3},{"$f":"IF(OR(C175=\"S\",C175=0),0,IF(ISERROR(K175),J175,SMALL(J175:K175,1)))","v":51},{"$f":"IF($C175=1,OFFSET(E175,-1,0)+1,OFFSET(E175,-1,0))","v":1},{"$f":"IF($C175=1,0,IF($C175=2,OFFSET(F175,-1,0)+1,OFFSET(F175,-1,0)))","v":6},{"$f":"IF(AND($C175<=2,$C175<>0),0,IF($C175=3,OFFSET(G175,-1,0)+1,OFFSET(G175,-1,0)))","v":2},{"$f":"IF(AND($C175<=3,$C175<>0),0,IF($C175=4,OFFSET(H175,-1,0)+1,OFFSET(H175,-1,0)))","v":0},0,51,103,{"$f":"IF(OR(W175>0,$C175=1),\"F\",\"\")","v":""},"Nível 3","Nível 3","-","SINAPI",null,"REFORMA ELÉTRICA","-",null,null,null,0,""]
["S",3,"S",0,1,6,2,0,0,0,0,"","Serviço","Serviço","-","AGETOP",70351,"BRACADEIRA METALICA TIPO \"U\" DIAM. 3/4\"","Un    ",700,null,null,0,""]
["S",3,"S",0,1,6,2,0,0,0,0,"","Serviço","Serviço","-","AGETOP",70352,"BRACADEIRA METALICA TIPO \"U\" DIAM. 1\"","Un    ",208,null,null,0,""]
["S",3,"S",0,1,6,2,0,0,0,0,"","Serviço","Serviço","-","AGETOP",70354,"BRACADEIRA METALICA TIPO \"U\" DIAM. 1.1/2\"","Un    ",35,null,null,0,""]
["S",3,"S",0,1,6,2,0,0,0,0,"","Serviço","Serviço","-","AGETOP",70355,"BRACADEIRA METALICA TIPO \"U\" DIAM. 2\"","Un    ",125,null,null,0,""]
["S",3,"S",0,1,6,2,0,0,0,0,"","Serviço","Serviço","-","AGETOP",70421,"BUCHA E ARRUELA METALICA DIAM. 3/4\"","PR    ",30,null,null,0,""]
["S",3,"S",0,1,6,2,0,0,0,0,"","Serviço","Serviço","-","AGETOP",70422,"BUCHA E ARRUELA METALICA DIAM. 1\"","PR    ",30,null,null,0,""]
["S",3,"S",0,1,6,2,0,0,0,0,"","Serviço","Serviço","-","AGETOP",70424,"BUCHA E ARRUELA METALICA DIAM. 1.1/2\"","PR    ",10,null,null,0,""]
["S",3,"S",0,1,6,2,0,0,0,0,"","Serviço","Serviço","-","AGETOP",70425,"BUCHA E ARRUELA METALICA DIAM. 2\"","PR    ",10,null,null,0,""]
["S",3,"S",0,1,6,2,0,0,0,0,"","Serviço","Serviço","-","SINAPI",91926,"CABO DE COBRE FLEXÍVEL ISOLADO, 2,5 MM², ANTI-CHAMA 450/750 V, PARA CIRCUITOS TERMINAIS - FORNECIMENTO E INSTALAÇÃO. AF_12/2015","M",3814,null,null,0,"Referência: AGETOP - 70563"]
["S",3,"S",0,1,6,2,0,0,0,0,"","Serviço","Serviço","-","SINAPI",91929,"CABO DE COBRE FLEXÍVEL ISOLADO, 4 MM², ANTI-CHAMA 0,6/1,0 KV, PARA CIRCUITOS TERMINAIS - FORNECIMENTO E INSTALAÇÃO. AF_12/2015","M",2956,null,null,0,"Referência: AGETOP - 70582"]
["S",3,"S",0,1,6,2,0,0,0,0,"","Serviço","Serviço","-","SINAPI",91931,"CABO DE COBRE FLEXÍVEL ISOLADO, 6 MM², ANTI-CHAMA 0,6/1,0 KV, PARA CIRCUITOS TERMINAIS - FORNECIMENTO E INSTALAÇÃO. AF_12/2015","M",1978,null,null,0,"Referência: AGETOP - 70583"]
["S",3,"S",0,1,6,2,0,0,0,0,"","Serviço","Serviço","-","SINAPI",91933,"CABO DE COBRE FLEXÍVEL ISOLADO, 10 MM², ANTI-CHAMA 0,6/1,0 KV, PARA CIRCUITOS TERMINAIS - FORNECIMENTO E INSTALAÇÃO. AF_12/2015","M",340,null,null,0,"Referência: AGETOP - 70584"]
["S",3,"S",0,1,6,2,0,0,0,0,"","Serviço","Serviço","-","SINAPI",92982,"CABO DE COBRE FLEXÍVEL ISOLADO, 16 MM², ANTI-CHAMA 0,6/1,0 KV, PARA DISTRIBUIÇÃO - FORNECIMENTO E INSTALAÇÃO. AF_12/2015","M",237.5,null,null,0,"Referência: AGETOP - 70510"]
[{"$f":"CHOOSE(1+LOG(1+2*(ORÇAMENTO.Nivel=\"Nível 1\")+4*(ORÇAMENTO.Nivel=\"Nível 2\")+8*(ORÇAMENTO.Nivel=\"Nível 3\")+16*(ORÇAMENTO.Nivel=\"Nível 4\")+32*(ORÇAMENTO.Nivel=\"Serviço\"),2),0,1,2,3,4,\"S\")","v":"S"},3,"S",0,1,6,2,0,{"$f":"IF(AND($C189<=4,$C189<>0),0,IF(AND($C189=\"S\",$W189>0),OFFSET(I189,-1,0)+1,OFFSET(I189,-1,0)))","v":0},0,0,"","Serviço","Serviço","-","SINAPI",92984,"CABO DE COBRE FLEXÍVEL ISOLADO, 25 MM², ANTI-CHAMA 0,6/1,0 KV, PARA DISTRIBUIÇÃO - FORNECIMENTO E INSTALAÇÃO. AF_12/2015","M",950,null,null,0,"Referência: AGETOP - 70511"]
["S",3,"S",0,1,6,2,0,0,0,0,"","Serviço","Serviço","-","SINAPI",92867,"CAIXA RETANGULAR 4\" X 2\" ALTA (2,00 M DO PISO), METÁLICA, INSTALADA EM PAREDE - FORNECIMENTO E INSTALAÇÃO. AF_12/2015","UN",100,null,null,0,""]
["S",3,"S",0,1,6,2,0,0,0,0,{"$f":"IF(OR(W191>0,$C191=1),\"F\",\"\")","v":""},"Serviço","Serviço","-","SINAPI",92865,"CAIXA OCTOGONAL 4\" X 4\", METÁLICA, INSTALADA EM LAJE - FORNECIMENTO E INSTALAÇÃO. AF_12/2015","UN",98,null,null,0,"Referência: AGETOP - 70682"]
["S",3,"S",0,{"$f":"IF($C192=1,OFFSET(E192,-1,0)+1,OFFSET(E192,-1,0))","v":1},{"$f":"IF($C192=1,0,IF($C192=2,OFFSET(F192,-1,0)+1,OFFSET(F192,-1,0)))","v":6},{"$f":"IF(AND($C192<=2,$C192<>0),0,IF($C192=3,OFFSET(G192,-1,0)+1,OFFSET(G192,-1,0)))","v":2},{"$f":"IF(AND($C192<=3,$C192<>0),0,IF($C192=4,OFFSET(H192,-1,0)+1,OFFSET(H192,-1,0)))","v":0},0,0,0,"","Serviço","Serviço","-","SINAPI",92868,"CAIXA RETANGULAR 4\" X 2\" MÉDIA (1,30 M DO PISO), METÁLICA, INSTALADA EM PAREDE - FORNECIMENTO E INSTALAÇÃO. AF_12/2015","UN",40,null,null,0,"Referência: AGETOP - 70691"]
["S",3,"S",0,1,6,2,0,0,0,0,"","Serviço","Serviço","-","SINAPI",97891,"CAIXA ENTERRADA ELÉTRICA RETANGULAR, EM ALVENARIA COM BLOCOS DE CONCRETO, FUNDO COM BRITA, DIMENSÕES INTERNAS: 0,4X0,4X0,4 M. AF_05/2018","UN",7,null,null,0,""]
["S",3,"S",0,1,6,2,0,0,0,0,"","Serviço","Serviço","-","SINAPI",95817,"CONDULETE DE PVC, TIPO X, PARA ELETRODUTO DE PVC SOLDÁVEL DN 25 MM (3/4''), APARENTE - FORNECIMENTO E INSTALAÇÃO. AF_11/2016","UN",150,null,null,0,""]
["S",3,"S",0,1,6,2,0,0,0,0,"","Serviço","Serviço","-","SINAPI",95818,"CONDULETE DE PVC, TIPO X, PARA ELETRODUTO DE PVC SOLDÁVEL DN 32 MM (1''), APARENTE - FORNECIMENTO E INSTALAÇÃO. AF_11/2016","UN",60,null,null,0,""]
["S",3,"S",0,1,6,2,0,0,0,0,"","Serviço","Serviço","-","SINAPI",93653,"DISJUNTOR MONOPOLAR TIPO DIN, CORRENTE NOMINAL DE 10A - FORNECIMENTO E INSTALAÇÃO. AF_04/2016","UN",12,null,null,0,""]
["S",3,"S",0,1,6,2,0,0,0,0,"","Serviço","Serviço","-","SINAPI",93654,"DISJUNTOR MONOPOLAR TIPO DIN, CORRENTE NOMINAL DE 16A - FORNECIMENTO E INSTALAÇÃO. AF_04/2016","UN",16,null,null,0,""]
["S",{"$f":"IF(OR(C198=\"s\",C198=0),OFFSET(B198,-1,0),C198)","v":3},{"$f":"IF(OFFSET(C198,-1,0)=\"L\",1,IF(OFFSET(C198,-1,0)=1,2,IF(OR(A198=\"s\",A198=0),\"S\",IF(AND(OFFSET(C198,-1,0)=2,A198=4),3,IF(AND(OR(OFFSET(C198,-1,0)=\"s\",OFFSET(C198,-1,0)=0),A198<>\"s\",A198>OFFSET(B198,-1,0)),OFFSET(B198,-1,0),A198)))))","v":"S"},{"$f":"IF(OR(C198=\"S\",C198=0),0,IF(ISERROR(K198),J198,SMALL(J198:K198,1)))","v":0},1,6,2,0,0,0,0,"","Serviço","Serviço","-","SINAPI",93656,"DISJUNTOR MONOPOLAR TIPO DIN, CORRENTE NOMINAL DE 25A - FORNECIMENTO E INSTALAÇÃO. AF_04/2016","UN",31,null,null,0,""]
["S",3,"S",0,1,6,2,0,0,0,0,"","Serviço","Serviço","-","SINAPI",93657,"DISJUNTOR MONOPOLAR TIPO DIN, CORRENTE NOMINAL DE 32A - FORNECIMENTO E INSTALAÇÃO. AF_04/2016","UN",11,null,null,0,""]
["S",3,"S",0,1,6,2,0,0,0,0,"","Serviço","Serviço","-","SINAPI",93670,"DISJUNTOR TRIPOLAR TIPO DIN, CORRENTE NOMINAL DE 25A - FORNECIMENTO E INSTALAÇÃO. AF_04/2016","UN",2,null,null,0,"Referência: AGETOP - 71173"]
["S",3,"S",0,1,6,2,0,0,0,0,"","Serviço","Serviço","-","SINAPI",93672,"DISJUNTOR TRIPOLAR TIPO DIN, CORRENTE NOMINAL DE 40A - FORNECIMENTO E INSTALAÇÃO. AF_04/2016","UN",2,null,null,0,"Referência: AGETOP - 71174"]
["S",3,"S",0,1,6,2,0,0,0,0,"","Serviço","Serviço","-","SINAPI","74130/5","DISJUNTOR TERMOMAGNETICO TRIPOLAR PADRAO NEMA (AMERICANO) 60 A 100A 240V, FORNECIMENTO E INSTALACAO","UN",8,null,null,0,""]
["S",3,"S",0,1,6,2,0,0,0,0,"","Serviço","Serviço","-","AGETOP",71201,"ELETRODUTO DE PVC RIGIDO DIAMETRO 3/4\"","M     ",1400,null,null,0,""]
["S",3,"S",0,1,6,2,0,0,0,0,"","Serviço","Serviço","-","AGETOP",71194,"ELETRODUTO PVC FLEXÍVEL - MANGUEIRA CORRUGADA LEVE - DIAM. 25MM","M     ",100,null,null,0,""]
["S",3,"S",0,1,6,2,0,0,0,0,"","Serviço","Serviço","-","AGETOP",71202,"ELETRODUTO DE PVC RIGIDO DIAMETRO 1\"","M     ",416,null,null,0,""]
["S",3,"S",0,1,6,2,0,0,0,0,"","Serviço","Serviço","-","AGETOP",71203,"ELETRODUTO DE PVC RIGIDO DIAMETRO 1.1/2\"","M     ",70,null,null,0,""]
["S",3,"S",0,1,6,2,0,0,0,0,"","Serviço","Serviço","-","AGETOP",71205,"ELETRODUTO DE PVC RIGIDO DIAMETRO 2\"","M     ",250,null,null,0,""]
["S",3,"S",0,1,6,2,0,0,0,0,"","Serviço","Serviço","-","AGETOP",71321,"FITA DE AUTO FUSAO, ROLO E 10,00 MM","Un    ",2,null,null,0,""]
["S",3,"S",0,1,6,2,0,0,0,0,"","Serviço","Serviço","-","SINAPI",91953,"INTERRUPTOR SIMPLES (1 MÓDULO), 10A/250V, INCLUINDO SUPORTE E PLACA - FORNECIMENTO E INSTALAÇÃO. AF_12/2015","UN",51,null,null,0,"Referência: AGETOP - 71440"]
["S",3,"S",0,1,6,2,0,0,0,0,"","Serviço","Serviço","-","COMPOSIÇÃO","COMP 387_SEE","LÂMPADA LED TUBULAR 18W ","UN ",434,null,null,0,""]
["S",3,"S",0,1,6,2,0,0,{"$f":"IF(OR($C211=\"S\",$C211=0),0,MATCH(0,OFFSET($D211,1,$C211,ROW($C$431)-ROW($C211)),0))","v":0},{"$f":"IF(OR($C211=\"S\",$C211=0),0,MATCH(OFFSET($D211,0,$C211)+1,OFFSET($D211,1,$C211,ROW($C$431)-ROW($C211)),0))","v":0},"","Serviço","Serviço","-","SINAPI",93043,"LÂMPADA LED 10 W BIVOLT BRANCA, FORMATO TRADICIONAL (BASE E27) - FORNECIMENTO E INSTALAÇÃO","UN",27,null,null,0,""]
["S",3,"S",0,1,6,2,0,0,0,0,"","Serviço","Serviço","-","SINAPI",97585,"LUMINÁRIA TIPO CALHA, DE SOBREPOR, COM 2 LÂMPADAS TUBULARES DE 18 W - FORNECIMENTO E INSTALAÇÃO. AF_11/2017","UN",217,null,null,0,""]
["S",3,"S",0,1,6,2,0,0,0,0,"","Serviço","Serviço","-","SINAPI",91884,"LUVA PARA ELETRODUTO, PVC, ROSCÁVEL, DN 25 MM (3/4\"), PARA CIRCUITOS TERMINAIS, INSTALADA EM PAREDE - FORNECIMENTO E INSTALAÇÃO. AF_12/2015","UN",700,null,null,0,"Referência: AGETOP - 71741"]
["S",3,"S",0,1,6,2,0,0,0,0,"","Serviço","Serviço","-","SINAPI",91885,"LUVA PARA ELETRODUTO, PVC, ROSCÁVEL, DN 32 MM (1\"), PARA CIRCUITOS TERMINAIS, INSTALADA EM PAREDE - FORNECIMENTO E INSTALAÇÃO. AF_12/2015","UN",208,null,null,0,"Referência: AGETOP - 71742"]
["S",3,"S",0,1,6,2,0,0,0,0,"","Serviço","Serviço","-","SINAPI",93013,"LUVA PARA ELETRODUTO, PVC, ROSCÁVEL, DN 50 MM (1 1/2\") - FORNECIMENTO E INSTALAÇÃO. AF_12/2015","UN",35,null,null,0,"Referência: AGETOP - 71744"]
["S",{"$f":"IF(OR(C216=\"s\",C216=0),OFFSET(B216,-1,0),C216)","v":3},{"$f":"IF(OFFSET(C216,-1,0)=\"L\",1,IF(OFFSET(C216,-1,0)=1,2,IF(OR(A216=\"s\",A216=0),\"S\",IF(AND(OFFSET(C216,-1,0)=2,A216=4),3,IF(AND(OR(OFFSET(C216,-1,0)=\"s\",OFFSET(C216,-1,0)=0),A216<>\"s\",A216>OFFSET(B216,-1,0)),OFFSET(B216,-1,0),A216)))))","v":"S"},{"$f":"IF(OR(C216=\"S\",C216=0),0,IF(ISERROR(K216),J216,SMALL(J216:K216,1)))","v":0},{"$f":"IF($C216=1,OFFSET(E216,-1,0)+1,OFFSET(E216,-1,0))","v":1},{"$f":"IF($C216=1,0,IF($C216=2,OFFSET(F216,-1,0)+1,OFFSET(F216,-1,0)))","v":6},{"$f":"IF(AND($C216<=2,$C216<>0),0,IF($C216=3,OFFSET(G216,-1,0)+1,OFFSET(G216,-1,0)))","v":2},{"$f":"IF(AND($C216<=3,$C216<>0),0,IF($C216=4,OFFSET(H216,-1,0)+1,OFFSET(H216,-1,0)))","v":0},0,0,0,{"$f":"IF(OR(W216>0,$C216=1),\"F\",\"\")","v":""},"Serviço","Serviço","-","SINAPI",93014,"LUVA PARA ELETRODUTO, PVC, ROSCÁVEL, DN 60 MM (2\") - FORNECIMENTO E INSTALAÇÃO. AF_12/2015","UN",125,null,null,0,"Referência: AGETOP - 71745"]
["S",3,"S",0,1,6,2,0,0,0,0,"","Serviço","Serviço","-","SINAPI",91902,"CURVA 90 GRAUS PARA ELETRODUTO, PVC, ROSCÁVEL, DN 25 MM (3/4\"), PARA CIRCUITOS TERMINAIS, INSTALADA EM LAJE - FORNECIMENTO E INSTALAÇÃO. AF_12/2015","UN",150,null,null,0,"Referência: AGETOP - 71141"]
["S",3,"S",0,1,6,2,0,0,0,0,"","Serviço","Serviço","-","SINAPI",91905,"CURVA 90 GRAUS PARA ELETRODUTO, PVC, ROSCÁVEL, DN 32 MM (1\"), PARA CIRCUITOS TERMINAIS, INSTALADA EM LAJE - FORNECIMENTO E INSTALAÇÃO. AF_12/2015","UN",100,null,null,0,"Referência: AGETOP - 71142"]
["S",3,"S",0,1,6,2,0,0,0,0,"","Serviço","Serviço","-","SINAPI",93018,"CURVA 90 GRAUS PARA ELETRODUTO, PVC, ROSCÁVEL, DN 50 MM (1 1/2\") - FORNECIMENTO E INSTALAÇÃO. AF_12/2015","UN",3,null,null,0,""]
["S",3,"S",0,1,6,2,0,0,0,0,"","Serviço","Serviço","-","SINAPI",93020,"CURVA 90 GRAUS PARA ELETRODUTO, PVC, ROSCÁVEL, DN 60 MM (2\") - FORNECIMENTO E INSTALAÇÃO. AF_12/2015","UN",10,null,null,0,""]
["S",3,"S",0,1,6,2,0,0,0,0,"","Serviço","Serviço","-","AGETOP",72190,"QUADRO DE DISTRIBUIÇÃO DE EMBUTIR METÁLICO CB-24E - 150A","Un    ",6,null,null,0,""]
["S",3,"S",0,1,6,2,0,0,0,0,"","Serviço","Serviço","-","SINAPI",91997,"TOMADA MÉDIA DE EMBUTIR (1 MÓDULO), 2P+T 20 A, INCLUINDO SUPORTE E PLACA - FORNECIMENTO E INSTALAÇÃO. AF_12/2015","UN",11,null,null,0,""]
["S",3,"S",0,1,6,2,0,0,0,0,"","Serviço","Serviço","-","SINAPI",92000,"TOMADA BAIXA DE EMBUTIR (1 MÓDULO), 2P+T 10 A, INCLUINDO SUPORTE E PLACA - FORNECIMENTO E INSTALAÇÃO. AF_12/2015","UN",68,null,null,0,"Referência: AGETOP - 72578"]
["S",3,"S",0,1,6,2,0,0,0,0,"","Serviço","Serviço","-","SINAPI",91993,"TOMADA ALTA DE EMBUTIR (1 MÓDULO), 2P+T 20 A, INCLUINDO SUPORTE E PLACA - FORNECIMENTO E INSTALAÇÃO. AF_12/2015","UN",30,null,null,0,"Referência: AGETOP - 72585"]
["S",3,"S",0,1,6,2,0,0,0,0,"","Serviço","Serviço","-","AGETOP",70287,"BORNE TERMINAL SAK 6 MM2","Un    ",11,null,null,0,""]
[2,2,2,76,1,7,0,0,0,205,76,"","Nível 2","Nível 2","-","AGETOP",71203,"INSTALAÇÕES HIDROSSANITÁRIAS","M     ",null,null,null,0,""]
[3,3,3,28,1,7,1,0,0,75,28,"","Nível 3","Nível 3","-","SINAPI",null,"PEÇAS E ACESSÓRIOS","-",null,null,null,0,""]
[4,4,4,7,1,7,1,1,0,27,7,"","Nível 4","Nível 4","-","SINAPI",null,"VASO SANITÁRIO E ACESSÓRIOS","-",null,null,null,0,""]
["S",4,"S",0,1,7,1,1,0,0,0,"","Serviço","Serviço","-","AGETOP",80502,"VASO SANITARIO","Un    ",8,null,null,0,""]
["S",4,"S",0,1,7,1,1,0,0,0,"","Serviço","Serviço","-","AGETOP",80510,"ANEL DE VEDAÇÃO PARA VASO SANITÁRIO","Un    ",8,null,null,0,""]
["S",4,"S",0,1,7,1,1,0,0,0,"","Serviço","Serviço","-","AGETOP",80513,"TUBO PARA VÁLVULA DE DESCARGA ( CURTO 1.1/4\" )","Un    ",8,null,null,0,""]
["S",4,"S",0,1,7,1,1,0,0,0,"","Serviço","Serviço","-","AGETOP",80514,"TUBO DE LIGACAO PVC CROMADO 1.1/2\" / ESPUDE  - (ENTRADA)","Un    ",8,null,null,0,""]
["S",4,"S",0,1,7,1,1,0,0,0,"","Serviço","Serviço","-","AGETOP",80517,"VÁLVULA DE DESCARGA DUPLO ACIONAMENTO COM ACABAMENTO CROMADO ANTIVANDALISMO","Un    ",8,null,null,0,""]
["S",4,"S",0,1,7,1,1,0,0,0,"","Serviço","Serviço","-","AGETOP",80520,"CONJUNTO DE FIXACAO P/VASO SANITARIO (PAR)","CJ    ",8,null,null,0,""]
[4,4,4,9,1,7,1,2,0,20,9,"","Nível 4","Nível 4","-","SINAPI",null,"LAVATÓRIO E ACESSÓRIOS","-",null,null,null,0,""]
["S",4,"S",0,1,7,1,2,0,0,0,"","Serviço","Serviço","-","AGETOP",80561,"SIFAO P/LAVATORIO PVC DIAM.1\"X1.1/2\"","Un    ",10,null,null,0,""]
["S",4,"S",0,1,7,1,2,0,0,0,"","Serviço","Serviço","-","AGETOP",80570,"TORNEIRA DE MESA PARA LAVATÓRIO DIÂMETRO DE 1/2\"","Un    ",10,null,null,0,""]
["S",4,"S",0,1,7,1,2,0,0,0,"","Serviço","Serviço","-","AGETOP",80590,"CUBA DE LOUCA DE EMBUTIR OVAL MÉDIA ","Un    ",8,null,null,0,""]
["S",4,"S",0,1,7,1,2,0,0,0,"","Serviço","Serviço","-","AGETOP",80580,"VALVULA P/LAVATORIO OU BEBEDOURO METALICO DIAMETRO 1\"","Un    ",10,null,null,0,""]
["S",4,"S",0,1,7,1,2,0,0,0,"","Serviço","Serviço","-","AGETOP",80556,"LIGAÇÃO FLEXÍVEL PVC DIAM.1/2\" (ENGATE)","Un    ",10,null,null,0,""]
["S",4,"S",0,1,7,1,2,0,0,0,"","Serviço","Serviço","-","AGETOP",80550,"FIXACAO P/LAVATORIO (PAR)","PAR   ",2,null,null,0,""]
["S",4,"S",0,1,7,1,2,0,0,0,"","Serviço","Serviço","-","AGETOP",80601,"MICTORIO DE LOUCA C/SIFAO INTEGRADO","Un    ",4,null,null,0,""]
["S",4,"S",0,1,7,1,2,0,0,0,"","Serviço","Serviço","-","AGETOP",80610,"KIT FERR.P/MICT.LOUCA (ESPUDE,CONEXÃO ENTR.PARAFUSOS)","Un    ",4,null,null,0,""]
[4,4,4,6,1,7,1,3,0,11,6,"","Nível 4","Nível 4","-","SINAPI",null,"PIA E ACESSÓRIOS","-",null,null,null,0,""]
["S",4,"S",0,1,7,1,3,0,0,0,"","Serviço","Serviço","-","SINAPI",86912,"TORNEIRA CROMADA LONGA, DE PAREDE, 1/2\" OU 3/4\", PARA PIA DE COZINHA, PADRÃO MÉDIO - FORNECIMENTO E INSTALAÇÃO. AF_12/2013","UN",4,null,null,0,""]
["S",4,"S",0,1,7,1,3,0,0,0,"","Serviço","Serviço","-","SINAPI",86881,"SIFÃO DO TIPO GARRAFA EM METAL CROMADO 1 X 1.1/2\" - FORNECIMENTO E INSTALAÇÃO. AF_12/2013","UN",4,null,null,0,"Referência: AGETOP - 80670"]
["S",4,"S",0,1,7,1,3,0,0,0,"","Serviço","Serviço","-","SINAPI",86878,"VÁLVULA EM METAL CROMADO TIPO AMERICANA 3.1/2\" X 1.1/2\" PARA PIA - FORNECIMENTO E INSTALAÇÃO. AF_12/2013","UN",4,null,null,0,""]
["S",4,"S",0,1,7,1,3,0,0,0,"","Serviço","Serviço","-","AGETOP",80688,"CUBA INOX 46X30X15CM E=0,6MM-AÇO 304 (CUBA Nº 1)","Un    ",2,null,null,0,""]
["S",4,"S",0,1,7,1,3,0,0,0,"","Serviço","Serviço","-","AGETOP",80693,"TANQUE (PANELAO) INOX 60 X 70 X 40 CM CH.18","Un    ",2,null,null,0,""]
[4,4,4,2,1,7,1,4,0,5,2,"","Nível 4","Nível 4","-","SINAPI",null,"FILTROS E CHUVEIROS","-",null,null,null,0,""]
["S",4,"S",0,1,7,1,4,0,0,0,"","Serviço","Serviço","-","AGETOP",80721,"CHUVEIRO ELÉTRICO EM PVC COM BRAÇO METÁLICO","Un    ",11,null,null,0,""]
[4,4,4,3,1,7,1,5,0,3,21,"","Nível 4","Nível 4","-","SINAPI",null,"REGISTROS","-",null,null,null,0,""]
["S",4,"S",0,1,7,1,5,{"$f":"IF(AND($C253<=4,$C253<>0),0,IF(AND($C253=\"S\",$W253>0),OFFSET(I253,-1,0)+1,OFFSET(I253,-1,0)))","v":0},0,0,"","Serviço","Serviço","-","AGETOP",80902,"REGISTRO DE GAVETA BRUTO DIAMETRO 3/4\"","Un    ",7,null,null,0,""]
["S",4,"S",0,1,7,1,5,0,0,0,"","Serviço","Serviço","-","AGETOP",80905,"REGISTRO DE GAVETA BRUTO DIAMETRO 1.1/2\"","Un    ",2,null,null,0,""]
[3,3,3,23,1,7,2,0,0,47,23,{"$f":"IF(OR(W255>0,$C255=1),\"F\",\"\")","v":""},"Nível 3","Nível 3","-","SINAPI",null,"ÁGUA FRIA","-",null,null,null,0,""]
[4,4,4,3,{"$f":"IF($C256=1,OFFSET(E256,-1,0)+1,OFFSET(E256,-1,0))","v":1},{"$f":"IF($C256=1,0,IF($C256=2,OFFSET(F256,-1,0)+1,OFFSET(F256,-1,0)))","v":7},{"$f":"IF(AND($C256<=2,$C256<>0),0,IF($C256=3,OFFSET(G256,-1,0)+1,OFFSET(G256,-1,0)))","v":2},{"$f":"IF(AND($C256<=3,$C256<>0),0,IF($C256=4,OFFSET(H256,-1,0)+1,OFFSET(H256,-1,0)))","v":1},0,22,3,"","Nível 4","Nível 4","-","SINAPI",null,"TUBOS DE PVC SOLDÁVEL","-",null,null,null,0,""]
["S",4,"S",0,1,7,2,1,0,0,0,"","Serviço","Serviço","-","AGETOP",81003,"TUBO SOLDAVEL PVC MARROM DIAMETRO 25 mm","M     ",15,null,null,0,""]
["S",4,"S",0,1,7,2,1,0,0,0,"","Serviço","Serviço","-","AGETOP",81006,"TUBO SOLDAVEL PVC MARROM DIAM. 50 mm","m     ",50,null,null,0,""]
[4,4,4,3,1,7,2,2,0,19,3,"","Nível 4","Nível 4","-","SINAPI",null,"ADAPTADORES DE PVC SOLDÁVEL","-",null,null,null,0,""]
["S",4,"S",0,1,7,2,2,0,0,0,"","Serviço","Serviço","-","SINAPI",89538,"ADAPTADOR CURTO COM BOLSA E ROSCA PARA REGISTRO, PVC, SOLDÁVEL, DN 25MM X 3/4\u0094, INSTALADO EM PRUMADA DE ÁGUA - FORNECIMENTO E INSTALAÇÃO. AF_12/2014","UN",14,null,null,0,""]
["S",4,"S",0,1,7,2,2,0,0,0,"","Serviço","Serviço","-","SINAPI",89596,"ADAPTADOR CURTO COM BOLSA E ROSCA PARA REGISTRO, PVC, SOLDÁVEL, DN 50MM X 1.1/2\u0094, INSTALADO EM PRUMADA DE ÁGUA - FORNECIMENTO E INSTALAÇÃO. AF_12/2014","UN",2,null,null,0,"Referência: AGETOP - 81069"]
[4,{"$f":"IF(OR(C262=\"s\",C262=0),OFFSET(B262,-1,0),C262)","v":4},{"$f":"IF(OFFSET(C262,-1,0)=\"L\",1,IF(OFFSET(C262,-1,0)=1,2,IF(OR(A262=\"s\",A262=0),\"S\",IF(AND(OFFSET(C262,-1,0)=2,A262=4),3,IF(AND(OR(OFFSET(C262,-1,0)=\"s\",OFFSET(C262,-1,0)=0),A262<>\"s\",A262>OFFSET(B262,-1,0)),OFFSET(B262,-1,0),A262)))))","v":4},{"$f":"IF(OR(C262=\"S\",C262=0),0,IF(ISERROR(K262),J262,SMALL(J262:K262,1)))","v":2},1,7,2,3,0,16,2,"","Nível 4","Nível 4","-","SINAPI",null,"BUCHAS","-",null,null,null,0,""]
["S",4,"S",0,1,7,2,3,0,0,0,"","Serviço","Serviço","-","AGETOP",81179,"BUCHA DE REDUCAO SOLDAVEL LONGA 50 X 25 mm","Un    ",7,null,null,0,""]
[4,4,4,5,1,7,2,4,0,14,5,"","Nível 4","Nível 4","-","SINAPI",null,"JOELHO","-",null,null,null,0,""]
["S",4,"S",0,1,7,2,4,0,0,0,"","Serviço","Serviço","-","AGETOP",81321,"JOELHO 90 GRAUS SOLDAVEL DIAMETRO 25 MM","Un    ",2,null,null,0,""]
["S",4,"S",0,1,7,2,4,0,0,0,"","Serviço","Serviço","-","AGETOP",81324,"JOELHO 90 GRAUS SOLDAVEL 50 mm (MARROM)","Un    ",5,null,null,0,""]
["S",4,"S",0,1,7,2,4,0,0,0,"","Serviço","Serviço","-","AGETOP",81360,"JOELHO RED.90 GRAUS SOLD.C/BUCHA LATAO 25X1/2\"","Un    ",2,null,null,0,""]
["S",4,"S",0,1,7,2,4,0,0,0,"","Serviço","Serviço","-","AGETOP",81369,"JOELHO 90 GRAUS SOLD. C/BUCHA LATAO 25 X 3/4\"","Un    ",4,null,null,0,""]
[4,4,4,4,1,7,2,5,0,9,4,"","Nível 4","Nível 4","-","SINAPI",null,"TÊ","-",null,null,null,0,""]
["S",4,"S",0,1,7,2,5,0,0,0,"","Serviço","Serviço","-","SINAPI",89617,"TE, PVC, SOLDÁVEL, DN 25MM, INSTALADO EM PRUMADA DE ÁGUA - FORNECIMENTO E INSTALAÇÃO. AF_12/2014","UN",1,null,null,0,""]
["S",4,"S",0,1,7,2,5,0,0,0,"","Serviço","Serviço","-","SINAPI",89625,"TE, PVC, SOLDÁVEL, DN 50MM, INSTALADO EM PRUMADA DE ÁGUA - FORNECIMENTO E INSTALAÇÃO. AF_12/2014","UN",7,null,null,0,"Referência: AGETOP - 81405"]
["S",4,"S",0,1,7,2,5,0,0,0,"","Serviço","Serviço","-","AGETOP",81445,"TE RED.SOLD.90GR.BUC.LATAO BOLSA CENT.25X25X1/2\"","Un    ",8,null,null,0,""]
[4,4,4,3,1,7,2,6,0,5,3,"","Nível 4","Nível 4","-","SINAPI",null,"ADESIVOS","-",null,null,null,0,""]
["S",4,"S",0,1,7,2,6,0,0,0,"","Serviço","Serviço","-","AGETOP",81501,"ADESIVO PLASTICO - FRASCO 850 G","Un    ",1,null,null,0,""]
["S",4,"S",0,1,7,2,6,0,{"$f":"IF(OR($C275=\"S\",$C275=0),0,MATCH(0,OFFSET($D275,1,$C275,ROW($C$431)-ROW($C275)),0))","v":0},{"$f":"IF(OR($C275=\"S\",$C275=0),0,MATCH(OFFSET($D275,0,$C275)+1,OFFSET($D275,1,$C275,ROW($C$431)-ROW($C275)),0))","v":0},"","Serviço","Serviço","-","AGETOP",81504,"SOLUCAO LIMPADORA 1000 CM3","Un    ",1,null,null,0,""]
[4,4,4,2,1,7,2,7,0,2,{"$error":"#N/A"},"","Nível 4","Nível 4","-","SINAPI",null,"CURVAS","-",null,null,null,0,""]
["S",4,"S",0,1,7,2,7,0,0,0,"","Serviço","Serviço","-","AGETOP",81550,"CURVA 45º DIAMETRO 50 MM","Un    ",2,null,null,0,""]
[3,3,3,19,1,7,3,0,0,24,19,"","Nível 3","Nível 3","-","SINAPI",null,"ESGOTO SANITÁRIO","-",null,null,null,0,""]
[4,4,4,4,1,7,3,1,0,18,4,"","Nível 4","Nível 4","-","SINAPI",null,"CORPO DE CAIXA SIFONADA / RALO","-",null,null,null,0,""]
["S",4,"S",0,1,7,3,1,0,0,0,"","Serviço","Serviço","-","AGETOP",81663,"CORPO CX. SIFONADA DIAM. 150 X 150 X 50","Un    ",4,null,null,0,""]
["S",4,"S",0,1,7,3,1,0,0,0,"","Serviço","Serviço","-","AGETOP",81696,"PROLONGAMENTO PARA CAIXA SIFONADA 150 MM","M     ",4,null,null,0,""]
["S",4,"S",0,1,7,3,1,0,0,0,"","Serviço","Serviço","-","AGETOP",81771,"GRELHA QUADRADA BRANCA DIAM. 150 MM","Un    ",4,null,null,0,""]
[4,4,4,4,1,7,3,2,0,14,4,"","Nível 4","Nível 4","-","SINAPI",null,"CURVAS","-",null,null,null,0,""]
["S",4,"S",0,1,7,3,2,0,0,0,"","Serviço","Serviço","-","AGETOP",81550,"CURVA 45º DIAMETRO 50 MM","Un    ",4,null,null,0,""]
["S",4,"S",0,1,7,3,2,0,0,0,"","Serviço","Serviço","-","AGETOP",81701,"CURVA 45 GRAUS DIAMETRO 40 MM","Un    ",4,null,null,0,""]
["S",4,"S",0,1,7,3,2,0,0,0,"","Serviço","Serviço","-","AGETOP",81730,"CURVA 90 GRAUS CURTA DIAM. 40 MM","Un    ",10,null,null,0,""]
[4,4,4,3,1,7,3,3,0,10,3,"","Nível 4","Nível 4","-","SINAPI",null,"JOELHOS","-",null,null,null,0,""]
["S",4,"S",0,1,7,3,3,0,0,0,"","Serviço","Serviço","-","AGETOP",81936,"JOELHO 90 GRAUS DIAMETRO 50 MM","Un    ",9,null,null,0,""]
["S",4,"S",0,1,7,3,3,0,0,0,"","Serviço","Serviço","-","AGETOP",81927,"JOELHO 90 GRAUS C/ANEL 40 mm ","Un    ",10,null,null,0,""]
[4,4,4,3,1,7,3,4,0,7,3,"","Nível 4","Nível 4","-","SINAPI",null,"TÊ","-",null,null,null,0,""]
["S",4,"S",0,1,7,3,4,0,0,0,"","Serviço","Serviço","-","SINAPI",89825,"TE, PVC, SERIE NORMAL, ESGOTO PREDIAL, DN 50 X 50 MM, JUNTA ELÁSTICA, FORNECIDO E INSTALADO EM PRUMADA DE ESGOTO SANITÁRIO OU VENTILAÇÃO. AF_12/2014","UN",5,null,null,0,""]
["S",4,"S",0,1,7,3,4,0,0,0,"","Serviço","Serviço","-","AGETOP",81975,"JUNCAO SIMPLES DIAM. 100 X 100 MM","Un    ",2,null,null,0,""]
[4,4,4,4,1,7,3,5,0,4,{"$error":"#N/A"},"","Nível 4","Nível 4","-","SINAPI",null,"TUBOS DE PVC SOLDÁVEL","-",null,null,null,0,""]
["S",4,"S",0,1,7,3,5,0,0,0,"","Serviço","Serviço","-","SINAPI",89711,"TUBO PVC, SERIE NORMAL, ESGOTO PREDIAL, DN 40 MM, FORNECIDO E INSTALADO EM RAMAL DE DESCARGA OU RAMAL DE ESGOTO SANITÁRIO. AF_12/2014","M",12,null,null,0,"Referência: AGETOP - 82301"]
["S",4,"S",0,1,7,3,5,0,0,0,"","Serviço","Serviço","-","SINAPI",89798,"TUBO PVC, SERIE NORMAL, ESGOTO PREDIAL, DN 50 MM, FORNECIDO E INSTALADO EM PRUMADA DE ESGOTO SANITÁRIO OU VENTILAÇÃO. AF_12/2014","M",30,null,null,0,""]
["S",4,"S",0,1,7,3,5,0,0,0,"","Serviço","Serviço","-","SINAPI",89800,"TUBO PVC, SERIE NORMAL, ESGOTO PREDIAL, DN 100 MM, FORNECIDO E INSTALADO EM PRUMADA DE ESGOTO SANITÁRIO OU VENTILAÇÃO. AF_12/2014","M",40,null,null,0,""]
[3,3,3,5,1,7,4,0,0,5,{"$error":"#N/A"},"","Nível 3","Nível 3","-","SINAPI",null,"OUTROS","-",null,null,null,0,""]
["S",3,"S",0,1,7,4,0,0,0,0,"","Serviço","Serviço","-","AGETOP",81825,"CAIXA DE PASSAGEM 60 X 60 CM SEM TAMPA","Un    ",3,null,null,0,""]
["S",3,"S",0,1,7,4,0,0,0,0,"","Serviço","Serviço","-","AGETOP",81826,"TAMPA EM CONCRETO ARMADO 25 MPA E=5CM PARA A CAIXA DE PASSAGEM 60X60CM","Un    ",3,null,null,0,""]
["S",3,"S",0,1,7,4,0,0,0,0,"","Serviço","Serviço","-","AGETOP",81854,"CAIXA DE GORDURA 600 L. CONCRETO PADRÃO AGETOP IMPERMEABILIZADA","un    ",2,null,null,0,""]
["S",3,"S",0,1,7,4,0,0,0,0,"","Serviço","Serviço","-","AGETOP",81885,"TERMINAL DE VENTILACAO DIAMETRO 50 MM","Un    ",2,null,null,0,""]
[{"$f":"CHOOSE(1+LOG(1+2*(ORÇAMENTO.Nivel=\"Nível 1\")+4*(ORÇAMENTO.Nivel=\"Nível 2\")+8*(ORÇAMENTO.Nivel=\"Nível 3\")+16*(ORÇAMENTO.Nivel=\"Nível 4\")+32*(ORÇAMENTO.Nivel=\"Serviço\"),2),0,1,2,3,4,\"S\")","v":2},{"$f":"IF(OR(C302=\"s\",C302=0),OFFSET(B302,-1,0),C302)","v":2},{"$f":"IF(OFFSET(C302,-1,0)=\"L\",1,IF(OFFSET(C302,-1,0)=1,2,IF(OR(A302=\"s\",A302=0),\"S\",IF(AND(OFFSET(C302,-1,0)=2,A302=4),3,IF(AND(OR(OFFSET(C302,-1,0)=\"s\",OFFSET(C302,-1,0)=0),A302<>\"s\",A302>OFFSET(B302,-1,0)),OFFSET(B302,-1,0),A302)))))","v":2},{"$f":"IF(OR(C302=\"S\",C302=0),0,IF(ISERROR(K302),J302,SMALL(J302:K302,1)))","v":26},{"$f":"IF($C302=1,OFFSET(E302,-1,0)+1,OFFSET(E302,-1,0))","v":1},{"$f":"IF($C302=1,0,IF($C302=2,OFFSET(F302,-1,0)+1,OFFSET(F302,-1,0)))","v":8},{"$f":"IF(AND($C302<=2,$C302<>0),0,IF($C302=3,OFFSET(G302,-1,0)+1,OFFSET(G302,-1,0)))","v":0},{"$f":"IF(AND($C302<=3,$C302<>0),0,IF($C302=4,OFFSET(H302,-1,0)+1,OFFSET(H302,-1,0)))","v":0},{"$f":"IF(AND($C302<=4,$C302<>0),0,IF(AND($C302=\"S\",$W302>0),OFFSET(I302,-1,0)+1,OFFSET(I302,-1,0)))","v":0},129,26,{"$f":"IF(OR(W302>0,$C302=1),\"F\",\"\")","v":""},"Nível 2","Nível 2","-",null,null,"INSTALAÇÕES ESPECIAIS","-",null,null,null,0,""]
["S",2,"S",0,1,8,0,0,0,0,0,"","Serviço","Serviço","-","AGETOP",91007,"CENTRAL DE GÁS PADRÃO AGETOP SEM INSTALAÇÕES (1+1 CILINDRO 45 KG)","Un    ",1,null,null,0,""]
["S",2,"S",0,1,8,0,0,0,0,0,"","Serviço","Serviço","-","AGETOP",91023,"UNIÃO S/BRONZE PRETA 3/4\" NPT 300 LBS","Un    ",3,null,null,0,""]
["S",2,"S",0,1,8,0,0,0,0,0,"","Serviço","Serviço","-","COMPOSIÇÃO","COMP 382_SEE","TE DE REDUCAO DE FERRO GALVANIZADO, COM ROSCA BSP, DE 3/4\" X 1/2\"","UN ",1,null,null,0,""]
["S",2,"S",0,1,8,0,0,0,0,0,"","Serviço","Serviço","-","COMPOSIÇÃO","COMP 383_SEE","BUCHA DE REDUCAO DE FERRO GALVANIZADO, COM ROSCA BSP, DE 1/2\" X 1/4\"","UN ",3,null,null,0,""]
["S",2,"S",0,1,8,0,0,0,0,0,"","Serviço","Serviço","-","AGETOP",91021,"LUVA GALVANIZADO DE REDUÇÃO 3/4\" X 1/2\" (GÁS)","Un    ",2,null,null,0,""]
["S",2,"S",0,1,8,0,0,0,0,0,"","Serviço","Serviço","-","SINAPI",92692,"NIPLE, EM FERRO GALVANIZADO, CONEXÃO ROSQUEADA, DN 15 (1/2\"), INSTALADO EM RAMAIS E SUB-RAMAIS DE GÁS - FORNECIMENTO E INSTALAÇÃO. AF_12/2015","UN",6,null,null,0,""]
["S",2,"S",0,1,8,0,0,0,0,0,"","Serviço","Serviço","-","AGETOP",91031,"NIPLE DUPLO 300 PSI 3/4\"","Un    ",6,null,null,0,""]
["S",2,"S",0,1,8,0,0,0,0,0,"","Serviço","Serviço","-","COMPOSIÇÃO","COMP 212_SEE","NIPLE DE REDUÇÃO 1/2\" X 1/4\" BSP","UN ",4,null,null,0,""]
["S",2,"S",0,1,8,0,0,0,0,0,"","Serviço","Serviço","-","COMPOSIÇÃO","COMP 213_SEE","NIPLE DE REDUÇÃO 3/4\" X 1/2\" BSP","UN ",4,null,null,0,""]
["S",2,"S",0,1,8,0,0,0,0,0,"","Serviço","Serviço","-","SINAPI",92688,"TUBO DE AÇO GALVANIZADO COM COSTURA, CLASSE MÉDIA, CONEXÃO ROSQUEADA, DN 20 (3/4\"), INSTALADO EM RAMAIS E SUB-RAMAIS DE GÁS - FORNECIMENTO E INSTALAÇÃO. AF_12/2015","M",18,null,null,0,""]
["S",2,"S",0,1,8,0,0,0,0,0,"","Serviço","Serviço","-","SINAPI",92701,"JOELHO 90 GRAUS, EM FERRO GALVANIZADO, CONEXÃO ROSQUEADA, DN 20 (3/4\"), INSTALADO EM RAMAIS E SUB-RAMAIS DE GÁS - FORNECIMENTO E INSTALAÇÃO. AF_12/2015","UN",6,null,null,0,""]
["S",2,"S",0,1,8,0,0,0,0,0,"","Serviço","Serviço","-","COMPOSIÇÃO","COMP 237_SEE","FITA ANTICORROSIVA","M",14,null,null,0,""]
["S",2,"S",0,1,8,0,0,0,0,0,"","Serviço","Serviço","-","AGETOP",91025,"VÁLVULA ESFERICA LATÃO 3/4\"","Un    ",3,null,null,0,""]
["S",2,"S",0,1,8,0,0,0,0,0,"","Serviço","Serviço","-","COMPOSIÇÃO","COMP 542_SEE","VÁLVULA UGV 3/4\" (S) LATÃO","UN ",2,null,null,0,""]
["S",2,"S",0,1,8,0,0,0,0,0,"","Serviço","Serviço","-","COMPOSIÇÃO","COMP 543_SEE","VÁLVULA UGV 1/2\" (S) LATÃO","UN ",2,null,null,0,""]
["S",2,"S",0,1,8,0,0,0,0,0,"","Serviço","Serviço","-","AGETOP",91029,"VALVULA DE RETENÇÃO LATÃO 1/2\" X 7/16\" NPT","Un    ",2,null,null,0,""]
["S",2,"S",0,1,8,0,0,0,0,0,"","Serviço","Serviço","-","COMPOSIÇÃO","COMP 211_SEE","REGULADOR DE 2º ESTÁGIO 5KG/H","UN ",2,null,null,0,""]
["S",2,"S",0,1,8,0,0,0,0,0,"","Serviço","Serviço","-","COMPOSIÇÃO","COMP 210_SEE","REGULADOR DE 1º ESTÁGIO 60KG/H MODELO AP-40  COM MANÔMETRO","UN ",1,null,null,0,""]
["S",2,"S",0,1,8,0,0,0,0,0,"","Serviço","Serviço","-","AGETOP",85003,"EXTINTOR PO QUIMICO SECO (6 KG) - CAPACIDADE EXTINTORA 20 BC","Un    ",1,null,null,0,""]
["S",2,"S",0,1,8,0,0,0,0,0,"","Serviço","Serviço","-","COMPOSIÇÃO","COMP 235_SEE","PLACA DE SINALIZAÇÃO EM PVC COD 01 - (300X300) PROIBIDO FUMAR","UN ",2,null,null,0,""]
["S",2,"S",0,1,8,0,0,0,0,0,"","Serviço","Serviço","-","COMPOSIÇÃO","COMP 236_SEE","PLACA DE SINALIZAÇÃO EM PVC COD 06 - (300X300) PERIGO INFLAMÁVEL","UN ",2,null,null,0,""]
["S",2,"S",0,1,8,0,0,0,0,0,"","Serviço","Serviço","-","AGETOP",91043,"BRAÇADEIRA METALICA TIPO \"D\" DIAM. 3/4\"","Un    ",5,null,null,0,""]
["S",2,"S",0,1,8,0,0,0,0,0,"","Serviço","Serviço","-","AGETOP",71863,"PARAFUSO P/BUCHA S-10","Un    ",10,null,null,0,""]
["S",2,"S",0,1,8,0,0,0,0,0,"","Serviço","Serviço","-","AGETOP",70393,"BUCHA DE NYLON S-10","Un    ",10,null,null,0,""]
["S",{"$f":"IF(OR(C327=\"s\",C327=0),OFFSET(B327,-1,0),C327)","v":2},{"$f":"IF(OFFSET(C327,-1,0)=\"L\",1,IF(OFFSET(C327,-1,0)=1,2,IF(OR(A327=\"s\",A327=0),\"S\",IF(AND(OFFSET(C327,-1,0)=2,A327=4),3,IF(AND(OR(OFFSET(C327,-1,0)=\"s\",OFFSET(C327,-1,0)=0),A327<>\"s\",A327>OFFSET(B327,-1,0)),OFFSET(B327,-1,0),A327)))))","v":"S"},{"$f":"IF(OR(C327=\"S\",C327=0),0,IF(ISERROR(K327),J327,SMALL(J327:K327,1)))","v":0},{"$f":"IF($C327=1,OFFSET(E327,-1,0)+1,OFFSET(E327,-1,0))","v":1},{"$f":"IF($C327=1,0,IF($C327=2,OFFSET(F327,-1,0)+1,OFFSET(F327,-1,0)))","v":8},{"$f":"IF(AND($C327<=2,$C327<>0),0,IF($C327=3,OFFSET(G327,-1,0)+1,OFFSET(G327,-1,0)))","v":0},{"$f":"IF(AND($C327<=3,$C327<>0),0,IF($C327=4,OFFSET(H327,-1,0)+1,OFFSET(H327,-1,0)))","v":0},0,0,0,{"$f":"IF(OR(W327>0,$C327=1),\"F\",\"\")","v":""},"Serviço","Serviço","-","AGETOP",91045,"SUPORTE PARA COLETOR","Un    ",2,null,null,0,""]
[{"$f":"CHOOSE(1+LOG(1+2*(ORÇAMENTO.Nivel=\"Nível 1\")+4*(ORÇAMENTO.Nivel=\"Nível 2\")+8*(ORÇAMENTO.Nivel=\"Nível 3\")+16*(ORÇAMENTO.Nivel=\"Nível 4\")+32*(ORÇAMENTO.Nivel=\"Serviço\"),2),0,1,2,3,4,\"S\")","v":2},2,2,7,1,9,0,0,{"$f":"IF(AND($C328<=4,$C328<>0),0,IF(AND($C328=\"S\",$W328>0),OFFSET(I328,-1,0)+1,OFFSET(I328,-1,0)))","v":0},103,7,"","Nível 2","Nível 2","-","AGETOP",91045,"ALVENARIAS E DIVISÓRIAS","Un    ",null,null,null,0,""]
[3,3,3,2,1,9,1,0,0,6,2,"","Nível 3","Nível 3","-","SINAPI",null,"BANHEIROS / VESTIÁRIOS","-",null,null,null,0,""]
["S",3,"S",0,1,9,1,0,0,0,0,"","Serviço","Serviço","-","SINAPI",87520,"ALVENARIA DE VEDAÇÃO DE BLOCOS CERÂMICOS FURADOS NA HORIZONTAL DE 9X19X19CM (ESPESSURA 9CM) DE PAREDES COM ÁREA LÍQUIDA MAIOR OU IGUAL A 6M² COM VÃOS E ARGAMASSA DE ASSENTAMENTO COM PREPARO MANUAL. AF_06/2014","M2",10.8,null,null,0,"Referência: AGETOP - 100201"]
[3,3,3,2,1,9,2,0,0,4,2,"","Nível 3","Nível 3","-","SINAPI",null,"COBERTURA BLOCO 5","-",null,null,null,0,""]
["S",3,"S",0,1,9,2,0,0,0,0,"","Serviço","Serviço","-","SINAPI",87520,"ALVENARIA DE VEDAÇÃO DE BLOCOS CERÂMICOS FURADOS NA HORIZONTAL DE 9X19X19CM (ESPESSURA 9CM) DE PAREDES COM ÁREA LÍQUIDA MAIOR OU IGUAL A 6M² COM VÃOS E ARGAMASSA DE ASSENTAMENTO COM PREPARO MANUAL. AF_06/2014","M2",83.44,null,null,0,"Referência: AGETOP - 100201"]
[3,3,3,2,1,9,3,0,0,2,22,"","Nível 3","Nível 3","-","SINAPI",null,"READEQUAÇÕES COZINHA","-",null,null,null,0,""]
["S",3,"S",0,1,9,3,0,0,0,0,"","Serviço","Serviço","-","SINAPI",87520,"ALVENARIA DE VEDAÇÃO DE BLOCOS CERÂMICOS FURADOS NA HORIZONTAL DE 9X19X19CM (ESPESSURA 9CM) DE PAREDES COM ÁREA LÍQUIDA MAIOR OU IGUAL A 6M² COM VÃOS E ARGAMASSA DE ASSENTAMENTO COM PREPARO MANUAL. AF_06/2014","M2",61.41,null,null,0,"Referência: AGETOP - 100201"]
[2,{"$f":"IF(OR(C335=\"s\",C335=0),OFFSET(B335,-1,0),C335)","v":2},{"$f":"IF(OFFSET(C335,-1,0)=\"L\",1,IF(OFFSET(C335,-1,0)=1,2,IF(OR(A335=\"s\",A335=0),\"S\",IF(AND(OFFSET(C335,-1,0)=2,A335=4),3,IF(AND(OR(OFFSET(C335,-1,0)=\"s\",OFFSET(C335,-1,0)=0),A335<>\"s\",A335>OFFSET(B335,-1,0)),OFFSET(B335,-1,0),A335)))))","v":2},{"$f":"IF(OR(C335=\"S\",C335=0),0,IF(ISERROR(K335),J335,SMALL(J335:K335,1)))","v":3},{"$f":"IF($C335=1,OFFSET(E335,-1,0)+1,OFFSET(E335,-1,0))","v":1},{"$f":"IF($C335=1,0,IF($C335=2,OFFSET(F335,-1,0)+1,OFFSET(F335,-1,0)))","v":10},{"$f":"IF(AND($C335<=2,$C335<>0),0,IF($C335=3,OFFSET(G335,-1,0)+1,OFFSET(G335,-1,0)))","v":0},{"$f":"IF(AND($C335<=3,$C335<>0),0,IF($C335=4,OFFSET(H335,-1,0)+1,OFFSET(H335,-1,0)))","v":0},0,96,3,{"$f":"IF(OR(W335>0,$C335=1),\"F\",\"\")","v":""},"Nível 2","Nível 2","-",null,null,"ESTRUTURAS METÁLICAS","-",null,null,null,0,""]
[3,3,3,2,1,10,1,0,0,2,14,"","Nível 3","Nível 3","-","AGETOP",150204,"COBERTURA BLOCO 5","Kg    ",null,null,null,0,""]
["S",3,"S",0,1,10,1,0,0,0,0,"","Serviço","Serviço","-","AGETOP",150204,"ESTRUTURA METÁLICA CONVENCIONAL EM AÇO TIPO MR-250 / ASTM A36 COM FUNDO ANTICORROSIVO","Kg    ",23106,null,null,0,""]
[2,2,2,8,1,11,0,0,0,93,8,"","Nível 2","Nível 2","-",null,null,"COBERTURAS","-",null,null,null,0,""]
[3,3,3,7,1,11,1,0,0,{"$f":"IF(OR($C339=\"S\",$C339=0),0,MATCH(0,OFFSET($D339,1,$C339,ROW($C$431)-ROW($C339)),0))","v":7},{"$f":"IF(OR($C339=\"S\",$C339=0),0,MATCH(OFFSET($D339,0,$C339)+1,OFFSET($D339,1,$C339,ROW($C$431)-ROW($C339)),0))","v":11},"","Nível 3","Nível 3","-","SINAPI",null,"COBERTURA BLOCO 5","-",null,null,null,0,""]
["S",3,"S",0,1,11,1,0,0,0,0,"","Serviço","Serviço","-","SINAPI",94445,"TELHAMENTO COM TELHA CERÂMICA CAPA-CANAL, TIPO PLAN, COM ATÉ 2 ÁGUAS, INCLUSO TRANSPORTE VERTICAL. AF_07/2019","M2",1242.51,null,null,0,"Referência: AGETOP - 160401"]
["S",3,"S",0,1,11,1,0,0,0,0,"","Serviço","Serviço","-","SINAPI",94228,"CALHA EM CHAPA DE AÇO GALVANIZADO NÚMERO 24, DESENVOLVIMENTO DE 50 CM, INCLUSO TRANSPORTE VERTICAL. AF_07/2019","M",56.95,null,null,0,"Referência: AGETOP - 160601"]
["S",{"$f":"IF(OR(C342=\"s\",C342=0),OFFSET(B342,-1,0),C342)","v":3},{"$f":"IF(OFFSET(C342,-1,0)=\"L\",1,IF(OFFSET(C342,-1,0)=1,2,IF(OR(A342=\"s\",A342=0),\"S\",IF(AND(OFFSET(C342,-1,0)=2,A342=4),3,IF(AND(OR(OFFSET(C342,-1,0)=\"s\",OFFSET(C342,-1,0)=0),A342<>\"s\",A342>OFFSET(B342,-1,0)),OFFSET(B342,-1,0),A342)))))","v":"S"},{"$f":"IF(OR(C342=\"S\",C342=0),0,IF(ISERROR(K342),J342,SMALL(J342:K342,1)))","v":0},{"$f":"IF($C342=1,OFFSET(E342,-1,0)+1,OFFSET(E342,-1,0))","v":1},{"$f":"IF($C342=1,0,IF($C342=2,OFFSET(F342,-1,0)+1,OFFSET(F342,-1,0)))","v":11},{"$f":"IF(AND($C342<=2,$C342<>0),0,IF($C342=3,OFFSET(G342,-1,0)+1,OFFSET(G342,-1,0)))","v":1},{"$f":"IF(AND($C342<=3,$C342<>0),0,IF($C342=4,OFFSET(H342,-1,0)+1,OFFSET(H342,-1,0)))","v":0},0,0,0,{"$f":"IF(OR(W342>0,$C342=1),\"F\",\"\")","v":""},"Serviço","Serviço","-","SINAPI",94231,"RUFO EM CHAPA DE AÇO GALVANIZADO NÚMERO 24, CORTE DE 25 CM, INCLUSO TRANSPORTE VERTICAL. AF_07/2019","M",15.14,null,null,0,"Referência: AGETOP - 160602"]
["S",{"$f":"IF(OR(C343=\"s\",C343=0),OFFSET(B343,-1,0),C343)","v":3},{"$f":"IF(OFFSET(C343,-1,0)=\"L\",1,IF(OFFSET(C343,-1,0)=1,2,IF(OR(A343=\"s\",A343=0),\"S\",IF(AND(OFFSET(C343,-1,0)=2,A343=4),3,IF(AND(OR(OFFSET(C343,-1,0)=\"s\",OFFSET(C343,-1,0)=0),A343<>\"s\",A343>OFFSET(B343,-1,0)),OFFSET(B343,-1,0),A343)))))","v":"S"},{"$f":"IF(OR(C343=\"S\",C343=0),0,IF(ISERROR(K343),J343,SMALL(J343:K343,1)))","v":0},{"$f":"IF($C343=1,OFFSET(E343,-1,0)+1,OFFSET(E343,-1,0))","v":1},{"$f":"IF($C343=1,0,IF($C343=2,OFFSET(F343,-1,0)+1,OFFSET(F343,-1,0)))","v":11},{"$f":"IF(AND($C343<=2,$C343<>0),0,IF($C343=3,OFFSET(G343,-1,0)+1,OFFSET(G343,-1,0)))","v":1},{"$f":"IF(AND($C343<=3,$C343<>0),0,IF($C343=4,OFFSET(H343,-1,0)+1,OFFSET(H343,-1,0)))","v":0},0,0,0,{"$f":"IF(OR(W343>0,$C343=1),\"F\",\"\")","v":""},"Serviço","Serviço","-","SINAPI",94221,"CUMEEIRA PARA TELHA CERÂMICA EMBOÇADA COM ARGAMASSA TRAÇO 1:2:9 (CIMENTO, CAL E AREIA) PARA TELHADOS COM ATÉ 2 ÁGUAS, INCLUSO TRANSPORTE VERTICAL. AF_07/2019","M",125.75,null,null,0,""]
["S",{"$f":"IF(OR(C344=\"s\",C344=0),OFFSET(B344,-1,0),C344)","v":3},{"$f":"IF(OFFSET(C344,-1,0)=\"L\",1,IF(OFFSET(C344,-1,0)=1,2,IF(OR(A344=\"s\",A344=0),\"S\",IF(AND(OFFSET(C344,-1,0)=2,A344=4),3,IF(AND(OR(OFFSET(C344,-1,0)=\"s\",OFFSET(C344,-1,0)=0),A344<>\"s\",A344>OFFSET(B344,-1,0)),OFFSET(B344,-1,0),A344)))))","v":"S"},{"$f":"IF(OR(C344=\"S\",C344=0),0,IF(ISERROR(K344),J344,SMALL(J344:K344,1)))","v":0},{"$f":"IF($C344=1,OFFSET(E344,-1,0)+1,OFFSET(E344,-1,0))","v":1},{"$f":"IF($C344=1,0,IF($C344=2,OFFSET(F344,-1,0)+1,OFFSET(F344,-1,0)))","v":11},{"$f":"IF(AND($C344<=2,$C344<>0),0,IF($C344=3,OFFSET(G344,-1,0)+1,OFFSET(G344,-1,0)))","v":1},{"$f":"IF(AND($C344<=3,$C344<>0),0,IF($C344=4,OFFSET(H344,-1,0)+1,OFFSET(H344,-1,0)))","v":0},0,0,0,{"$f":"IF(OR(W344>0,$C344=1),\"F\",\"\")","v":""},"Serviço","Serviço","-","AGETOP",160404,"EMBOCAMENTO DE BEIRAL","M     ",211.58,null,null,0,""]
["S",{"$f":"IF(OR(C345=\"s\",C345=0),OFFSET(B345,-1,0),C345)","v":3},{"$f":"IF(OFFSET(C345,-1,0)=\"L\",1,IF(OFFSET(C345,-1,0)=1,2,IF(OR(A345=\"s\",A345=0),\"S\",IF(AND(OFFSET(C345,-1,0)=2,A345=4),3,IF(AND(OR(OFFSET(C345,-1,0)=\"s\",OFFSET(C345,-1,0)=0),A345<>\"s\",A345>OFFSET(B345,-1,0)),OFFSET(B345,-1,0),A345)))))","v":"S"},{"$f":"IF(OR(C345=\"S\",C345=0),0,IF(ISERROR(K345),J345,SMALL(J345:K345,1)))","v":0},{"$f":"IF($C345=1,OFFSET(E345,-1,0)+1,OFFSET(E345,-1,0))","v":1},{"$f":"IF($C345=1,0,IF($C345=2,OFFSET(F345,-1,0)+1,OFFSET(F345,-1,0)))","v":11},{"$f":"IF(AND($C345<=2,$C345<>0),0,IF($C345=3,OFFSET(G345,-1,0)+1,OFFSET(G345,-1,0)))","v":1},{"$f":"IF(AND($C345<=3,$C345<>0),0,IF($C345=4,OFFSET(H345,-1,0)+1,OFFSET(H345,-1,0)))","v":0},0,0,0,{"$f":"IF(OR(W345>0,$C345=1),\"F\",\"\")","v":""},"Serviço","Serviço","-","AGETOP",160403,"EMBOCAMENTO LATERAL  (OITOES)","m     ",21.9,null,null,0,""]
[2,2,2,14,1,12,0,0,0,85,14,"","Nível 2","Nível 2","-",null,null,"ESQUADRIAS METÁLICAS","-",null,null,null,0,""]
[3,3,3,3,1,12,1,0,0,13,3,"","Nível 3","Nível 3","-","SINAPI",null,"BANHEIROS / VESTIÁRIOS","-",null,null,null,0,""]
["S",{"$f":"IF(OR(C348=\"s\",C348=0),OFFSET(B348,-1,0),C348)","v":3},{"$f":"IF(OFFSET(C348,-1,0)=\"L\",1,IF(OFFSET(C348,-1,0)=1,2,IF(OR(A348=\"s\",A348=0),\"S\",IF(AND(OFFSET(C348,-1,0)=2,A348=4),3,IF(AND(OR(OFFSET(C348,-1,0)=\"s\",OFFSET(C348,-1,0)=0),A348<>\"s\",A348>OFFSET(B348,-1,0)),OFFSET(B348,-1,0),A348)))))","v":"S"},{"$f":"IF(OR(C348=\"S\",C348=0),0,IF(ISERROR(K348),J348,SMALL(J348:K348,1)))","v":0},{"$f":"IF($C348=1,OFFSET(E348,-1,0)+1,OFFSET(E348,-1,0))","v":1},{"$f":"IF($C348=1,0,IF($C348=2,OFFSET(F348,-1,0)+1,OFFSET(F348,-1,0)))","v":12},{"$f":"IF(AND($C348<=2,$C348<>0),0,IF($C348=3,OFFSET(G348,-1,0)+1,OFFSET(G348,-1,0)))","v":1},{"$f":"IF(AND($C348<=3,$C348<>0),0,IF($C348=4,OFFSET(H348,-1,0)+1,OFFSET(H348,-1,0)))","v":0},0,0,0,{"$f":"IF(OR(W348>0,$C348=1),\"F\",\"\")","v":""},"Serviço","Serviço","-","AGETOP",180501,"PORTA DE ABRIR EM CHAPA PF-1 C/FERRAGENS","m2    ",2.8800000000000003,null,null,0,""]
["S",3,"S",0,1,12,1,0,0,0,0,"","Serviço","Serviço","-","AGETOP",180381,"ESQ. MAXIMO AR CHAPA/VIDRO J3/J5/J6/J8 C/FERRAGENS","m2    ",24.84,null,null,0,""]
[3,3,3,3,1,12,2,0,0,10,3,"","Nível 3","Nível 3","-","SINAPI",null,"COBERTURA BLOCO 5","-",null,null,null,0,""]
["S",{"$f":"IF(OR(C351=\"s\",C351=0),OFFSET(B351,-1,0),C351)","v":3},{"$f":"IF(OFFSET(C351,-1,0)=\"L\",1,IF(OFFSET(C351,-1,0)=1,2,IF(OR(A351=\"s\",A351=0),\"S\",IF(AND(OFFSET(C351,-1,0)=2,A351=4),3,IF(AND(OR(OFFSET(C351,-1,0)=\"s\",OFFSET(C351,-1,0)=0),A351<>\"s\",A351>OFFSET(B351,-1,0)),OFFSET(B351,-1,0),A351)))))","v":"S"},{"$f":"IF(OR(C351=\"S\",C351=0),0,IF(ISERROR(K351),J351,SMALL(J351:K351,1)))","v":0},{"$f":"IF($C351=1,OFFSET(E351,-1,0)+1,OFFSET(E351,-1,0))","v":1},{"$f":"IF($C351=1,0,IF($C351=2,OFFSET(F351,-1,0)+1,OFFSET(F351,-1,0)))","v":12},{"$f":"IF(AND($C351<=2,$C351<>0),0,IF($C351=3,OFFSET(G351,-1,0)+1,OFFSET(G351,-1,0)))","v":2},{"$f":"IF(AND($C351<=3,$C351<>0),0,IF($C351=4,OFFSET(H351,-1,0)+1,OFFSET(H351,-1,0)))","v":0},0,0,0,{"$f":"IF(OR(W351>0,$C351=1),\"F\",\"\")","v":""},"Serviço","Serviço","-","AGETOP",180403,"ESQ.MAXIMO AR CHAPA/VIDRO J1/J2/J7/J15 C/FERRAGENS","m2    ",3.5999999999999996,null,null,0,""]
["S",3,"S",0,1,12,2,0,0,0,0,"","Serviço","Serviço","-","AGETOP",180501,"PORTA DE ABRIR EM CHAPA PF-1 C/FERRAGENS","m2    ",18.48,null,null,0,""]
[3,3,3,2,1,12,3,0,0,7,2,"","Nível 3","Nível 3","-","SINAPI",null,"SECRETARIA","-",null,null,null,0,""]
["S",3,"S",0,1,12,3,0,0,0,0,"","Serviço","Serviço","-","COMPOSIÇÃO","COMP 007_SEE","GUICHÊ CANTONEIRA/GRADE PARA VIDRO","M²",1.44,null,null,0,""]
[3,{"$f":"IF(OR(C355=\"s\",C355=0),OFFSET(B355,-1,0),C355)","v":3},{"$f":"IF(OFFSET(C355,-1,0)=\"L\",1,IF(OFFSET(C355,-1,0)=1,2,IF(OR(A355=\"s\",A355=0),\"S\",IF(AND(OFFSET(C355,-1,0)=2,A355=4),3,IF(AND(OR(OFFSET(C355,-1,0)=\"s\",OFFSET(C355,-1,0)=0),A355<>\"s\",A355>OFFSET(B355,-1,0)),OFFSET(B355,-1,0),A355)))))","v":3},{"$f":"IF(OR(C355=\"S\",C355=0),0,IF(ISERROR(K355),J355,SMALL(J355:K355,1)))","v":5},{"$f":"IF($C355=1,OFFSET(E355,-1,0)+1,OFFSET(E355,-1,0))","v":1},{"$f":"IF($C355=1,0,IF($C355=2,OFFSET(F355,-1,0)+1,OFFSET(F355,-1,0)))","v":12},{"$f":"IF(AND($C355<=2,$C355<>0),0,IF($C355=3,OFFSET(G355,-1,0)+1,OFFSET(G355,-1,0)))","v":4},{"$f":"IF(AND($C355<=3,$C355<>0),0,IF($C355=4,OFFSET(H355,-1,0)+1,OFFSET(H355,-1,0)))","v":0},0,5,{"$error":"#N/A"},{"$f":"IF(OR(W355>0,$C355=1),\"F\",\"\")","v":""},"Nível 3","Nível 3","-","SINAPI",null,"READEQUAÇÕES COZINHA","-",null,null,null,0,""]
["S",3,"S",0,1,12,4,0,0,0,0,"","Serviço","Serviço","-","AGETOP",180303,"PORTA DE ENROLAR C/FERRAGENS","m2    ",3.42,null,null,0,""]
["S",{"$f":"IF(OR(C357=\"s\",C357=0),OFFSET(B357,-1,0),C357)","v":3},{"$f":"IF(OFFSET(C357,-1,0)=\"L\",1,IF(OFFSET(C357,-1,0)=1,2,IF(OR(A357=\"s\",A357=0),\"S\",IF(AND(OFFSET(C357,-1,0)=2,A357=4),3,IF(AND(OR(OFFSET(C357,-1,0)=\"s\",OFFSET(C357,-1,0)=0),A357<>\"s\",A357>OFFSET(B357,-1,0)),OFFSET(B357,-1,0),A357)))))","v":"S"},{"$f":"IF(OR(C357=\"S\",C357=0),0,IF(ISERROR(K357),J357,SMALL(J357:K357,1)))","v":0},{"$f":"IF($C357=1,OFFSET(E357,-1,0)+1,OFFSET(E357,-1,0))","v":1},{"$f":"IF($C357=1,0,IF($C357=2,OFFSET(F357,-1,0)+1,OFFSET(F357,-1,0)))","v":12},{"$f":"IF(AND($C357<=2,$C357<>0),0,IF($C357=3,OFFSET(G357,-1,0)+1,OFFSET(G357,-1,0)))","v":4},{"$f":"IF(AND($C357<=3,$C357<>0),0,IF($C357=4,OFFSET(H357,-1,0)+1,OFFSET(H357,-1,0)))","v":0},0,0,0,{"$f":"IF(OR(W357>0,$C357=1),\"F\",\"\")","v":""},"Serviço","Serviço","-","AGETOP",180501,"PORTA DE ABRIR EM CHAPA PF-1 C/FERRAGENS","m2    ",5.0400000000000009,null,null,0,""]
["S",3,"S",0,1,12,4,0,0,0,0,"","Serviço","Serviço","-","AGETOP",180403,"ESQ.MAXIMO AR CHAPA/VIDRO J1/J2/J7/J15 C/FERRAGENS","m2    ",2.4,null,null,0,""]
["S",3,"S",0,1,12,4,0,0,0,0,"","Serviço","Serviço","-","AGETOP",180401,"ESQ.DE CORRER CHAPA/VIDRO J9/J10/J12/J13 C/FERRAGENS","m2    ",12,null,null,0,""]
[2,2,2,9,1,13,0,0,0,71,9,"","Nível 2","Nível 2","-","SINAPI",null,"VIDROS","-",null,null,null,0,""]
[3,3,3,2,1,13,1,0,0,8,2,"","Nível 3","Nível 3","-","SINAPI",null,"BANHEIROS / VESTIÁRIOS","-",null,null,null,0,""]
["S",3,"S",0,1,13,1,0,0,0,0,"","Serviço","Serviço","-","AGETOP",190102,"VIDRO LISO 4 MM - COLOCADO","m2    ",24.8,null,null,0,""]
[3,3,3,2,1,13,2,0,0,6,2,"","Nível 3","Nível 3","-","SINAPI",null,"COBERTURA BLOCO 5","-",null,null,null,0,""]
["S",3,"S",0,1,13,2,0,0,0,0,"","Serviço","Serviço","-","AGETOP",190102,"VIDRO LISO 4 MM - COLOCADO","m2    ",3.6,null,null,0,""]
[3,3,3,2,1,13,3,0,0,4,2,"","Nível 3","Nível 3","-","SINAPI",null,"SECRETARIA","-",null,null,null,0,""]
["S",3,"S",0,1,13,3,0,0,0,0,"","Serviço","Serviço","-","AGETOP",190102,"VIDRO LISO 4 MM - COLOCADO","m2    ",1.44,null,null,0,""]
[3,3,3,2,1,13,4,0,0,2,{"$error":"#N/A"},"","Nível 3","Nível 3","-","SINAPI",null,"READEQUAÇÕES COZINHA","-",null,null,null,0,""]
["S",3,"S",0,1,13,4,0,0,0,0,"","Serviço","Serviço","-","AGETOP",190102,"VIDRO LISO 4 MM - COLOCADO","m2    ",6.4,null,null,0,""]
[2,2,2,11,1,14,0,0,0,62,11,"","Nível 2","Nível 2","-",null,null,"REVESTIMENTO DE PAREDE","-",null,null,null,0,""]
[3,3,3,2,1,14,1,0,0,10,2,"","Nível 3","Nível 3","-","SINAPI",null,"BANHEIROS / VESTIÁRIOS","-",null,null,null,0,""]
["S",3,"S",0,1,14,1,0,0,0,0,"","Serviço","Serviço","-","SINAPI",87273,"REVESTIMENTO CERÂMICO PARA PAREDES INTERNAS COM PLACAS TIPO ESMALTADA EXTRA DE DIMENSÕES 33X45 CM APLICADAS EM AMBIENTES DE ÁREA MAIOR QUE 5 M² NA ALTURA INTEIRA DAS PAREDES. AF_06/2014","M2",211.23,null,null,0,""]
[3,3,3,3,1,14,2,0,0,8,3,"","Nível 3","Nível 3","-","SINAPI",null,"COBERTURA BLOCO 5","-",null,null,null,0,""]
["S",3,"S",0,1,14,2,0,0,0,0,"","Serviço","Serviço","-","SINAPI",87904,"CHAPISCO APLICADO EM ALVENARIA (COM PRESENÇA DE VÃOS) E ESTRUTURAS DE CONCRETO DE FACHADA, COM COLHER DE PEDREIRO.  ARGAMASSA TRAÇO 1:3 COM PREPARO MANUAL. AF_06/2014","M2",166.88,null,null,0,"Referência: AGETOP - 200101"]
["S",3,"S",0,1,14,2,0,0,0,0,"","Serviço","Serviço","-","SINAPI",87547,"MASSA ÚNICA, PARA RECEBIMENTO DE PINTURA, EM ARGAMASSA TRAÇO 1:2:8, PREPARO MECÂNICO COM BETONEIRA 400L, APLICADA MANUALMENTE EM FACES INTERNAS DE PAREDES, ESPESSURA DE 10MM, COM EXECUÇÃO DE TALISCAS. AF_06/2014","M2",166.88,null,null,0,""]
[3,{"$f":"IF(OR(C375=\"s\",C375=0),OFFSET(B375,-1,0),C375)","v":3},{"$f":"IF(OFFSET(C375,-1,0)=\"L\",1,IF(OFFSET(C375,-1,0)=1,2,IF(OR(A375=\"s\",A375=0),\"S\",IF(AND(OFFSET(C375,-1,0)=2,A375=4),3,IF(AND(OR(OFFSET(C375,-1,0)=\"s\",OFFSET(C375,-1,0)=0),A375<>\"s\",A375>OFFSET(B375,-1,0)),OFFSET(B375,-1,0),A375)))))","v":3},{"$f":"IF(OR(C375=\"S\",C375=0),0,IF(ISERROR(K375),J375,SMALL(J375:K375,1)))","v":5},{"$f":"IF($C375=1,OFFSET(E375,-1,0)+1,OFFSET(E375,-1,0))","v":1},{"$f":"IF($C375=1,0,IF($C375=2,OFFSET(F375,-1,0)+1,OFFSET(F375,-1,0)))","v":14},{"$f":"IF(AND($C375<=2,$C375<>0),0,IF($C375=3,OFFSET(G375,-1,0)+1,OFFSET(G375,-1,0)))","v":3},{"$f":"IF(AND($C375<=3,$C375<>0),0,IF($C375=4,OFFSET(H375,-1,0)+1,OFFSET(H375,-1,0)))","v":0},0,5,18,{"$f":"IF(OR(W375>0,$C375=1),\"F\",\"\")","v":""},"Nível 3","Nível 3","-","SINAPI",null,"READEQUAÇÕES COZINHA","-",null,null,null,0,""]
["S",{"$f":"IF(OR(C376=\"s\",C376=0),OFFSET(B376,-1,0),C376)","v":3},{"$f":"IF(OFFSET(C376,-1,0)=\"L\",1,IF(OFFSET(C376,-1,0)=1,2,IF(OR(A376=\"s\",A376=0),\"S\",IF(AND(OFFSET(C376,-1,0)=2,A376=4),3,IF(AND(OR(OFFSET(C376,-1,0)=\"s\",OFFSET(C376,-1,0)=0),A376<>\"s\",A376>OFFSET(B376,-1,0)),OFFSET(B376,-1,0),A376)))))","v":"S"},{"$f":"IF(OR(C376=\"S\",C376=0),0,IF(ISERROR(K376),J376,SMALL(J376:K376,1)))","v":0},{"$f":"IF($C376=1,OFFSET(E376,-1,0)+1,OFFSET(E376,-1,0))","v":1},{"$f":"IF($C376=1,0,IF($C376=2,OFFSET(F376,-1,0)+1,OFFSET(F376,-1,0)))","v":14},{"$f":"IF(AND($C376<=2,$C376<>0),0,IF($C376=3,OFFSET(G376,-1,0)+1,OFFSET(G376,-1,0)))","v":3},{"$f":"IF(AND($C376<=3,$C376<>0),0,IF($C376=4,OFFSET(H376,-1,0)+1,OFFSET(H376,-1,0)))","v":0},0,0,0,{"$f":"IF(OR(W376>0,$C376=1),\"F\",\"\")","v":""},"Serviço","Serviço","-","SINAPI",87904,"CHAPISCO APLICADO EM ALVENARIA (COM PRESENÇA DE VÃOS) E ESTRUTURAS DE CONCRETO DE FACHADA, COM COLHER DE PEDREIRO.  ARGAMASSA TRAÇO 1:3 COM PREPARO MANUAL. AF_06/2014","M2",122.82,null,null,0,"Referência: AGETOP - 200101"]
["S",3,"S",0,1,14,3,0,0,0,0,"","Serviço","Serviço","-","SINAPI",87547,"MASSA ÚNICA, PARA RECEBIMENTO DE PINTURA, EM ARGAMASSA TRAÇO 1:2:8, PREPARO MECÂNICO COM BETONEIRA 400L, APLICADA MANUALMENTE EM FACES INTERNAS DE PAREDES, ESPESSURA DE 10MM, COM EXECUÇÃO DE TALISCAS. AF_06/2014","M2",79.41,null,null,0,""]
["S",3,"S",0,1,14,3,0,0,0,0,"","Serviço","Serviço","-","AGETOP",200201,"EMBOÇO (1CI:4 ARML)","m2    ",43.41,null,null,0,""]
[{"$f":"CHOOSE(1+LOG(1+2*(ORÇAMENTO.Nivel=\"Nível 1\")+4*(ORÇAMENTO.Nivel=\"Nível 2\")+8*(ORÇAMENTO.Nivel=\"Nível 3\")+16*(ORÇAMENTO.Nivel=\"Nível 4\")+32*(ORÇAMENTO.Nivel=\"Serviço\"),2),0,1,2,3,4,\"S\")","v":"S"},3,"S",0,{"$f":"IF($C379=1,OFFSET(E379,-1,0)+1,OFFSET(E379,-1,0))","v":1},{"$f":"IF($C379=1,0,IF($C379=2,OFFSET(F379,-1,0)+1,OFFSET(F379,-1,0)))","v":14},{"$f":"IF(AND($C379<=2,$C379<>0),0,IF($C379=3,OFFSET(G379,-1,0)+1,OFFSET(G379,-1,0)))","v":3},{"$f":"IF(AND($C379<=3,$C379<>0),0,IF($C379=4,OFFSET(H379,-1,0)+1,OFFSET(H379,-1,0)))","v":0},{"$f":"IF(AND($C379<=4,$C379<>0),0,IF(AND($C379=\"S\",$W379>0),OFFSET(I379,-1,0)+1,OFFSET(I379,-1,0)))","v":0},0,0,{"$f":"IF(OR(W379>0,$C379=1),\"F\",\"\")","v":""},"Serviço","Serviço","-","SINAPI",87273,"REVESTIMENTO CERÂMICO PARA PAREDES INTERNAS COM PLACAS TIPO ESMALTADA EXTRA DE DIMENSÕES 33X45 CM APLICADAS EM AMBIENTES DE ÁREA MAIOR QUE 5 M² NA ALTURA INTEIRA DAS PAREDES. AF_06/2014","M2",188.25,null,null,0,""]
[2,2,2,3,1,15,0,0,0,51,3,"","Nível 2","Nível 2","-",null,null,"FORROS","-",null,null,null,0,""]
[3,{"$f":"IF(OR(C381=\"s\",C381=0),OFFSET(B381,-1,0),C381)","v":3},{"$f":"IF(OFFSET(C381,-1,0)=\"L\",1,IF(OFFSET(C381,-1,0)=1,2,IF(OR(A381=\"s\",A381=0),\"S\",IF(AND(OFFSET(C381,-1,0)=2,A381=4),3,IF(AND(OR(OFFSET(C381,-1,0)=\"s\",OFFSET(C381,-1,0)=0),A381<>\"s\",A381>OFFSET(B381,-1,0)),OFFSET(B381,-1,0),A381)))))","v":3},{"$f":"IF(OR(C381=\"S\",C381=0),0,IF(ISERROR(K381),J381,SMALL(J381:K381,1)))","v":2},1,15,1,0,0,2,6,"","Nível 3","Nível 3","-","SINAPI",null,"PVC COM ESTRUTURA","-",null,null,null,0,""]
["S",3,"S",0,1,15,1,0,0,0,0,"","Serviço","Serviço","-","SINAPI",96116,"FORRO EM RÉGUAS DE PVC, FRISADO, PARA AMBIENTES COMERCIAIS, INCLUSIVE ESTRUTURA DE FIXAÇÃO. AF_05/2017_P","M2",732.77,null,null,0,"Referência: AGETOP - 210460"]
[2,2,2,14,1,16,0,0,0,48,14,"","Nível 2","Nível 2","-",null,null,"REVESTIMENTO DE PISO","-",null,null,null,0,""]
[3,3,3,3,1,16,1,0,0,13,3,"","Nível 3","Nível 3","-","SINAPI",null,"ACESSIBILIDADE CALÇADA","-",null,null,null,0,""]
["S",3,"S",0,1,16,1,0,0,0,0,"","Serviço","Serviço","-","AGETOP",221126,"PISO DE LADRILHO HIDRÁULICO COLORIDO MODELO TÁTIL ( ALERTA OU DIRECIONAL) SEM LASTRO","m2    ",122.32,null,null,0,""]
["S",3,"S",0,1,16,1,0,0,0,0,"","Serviço","Serviço","-","AGETOP",220102,"PISO CONCRETO DESEMPENADO ESPESSURA = 5 CM  1:2,5:3,5","m2    ",1900.85,null,null,0,""]
[3,3,3,4,1,16,2,0,0,10,4,"","Nível 3","Nível 3","-","SINAPI",null,"COBERTURA BLOCO 5","-",null,null,null,0,""]
["S",3,"S",0,1,16,2,0,0,0,0,"","Serviço","Serviço","-","AGETOP",221101,"GRANITINA 8MM FUNDIDA COM CONTRAPISO (1CI:3ARML) E=2CM E JUNTA PLASTICA 27MM","m2    ",188.83,null,null,0,""]
["S",{"$f":"IF(OR(C389=\"s\",C389=0),OFFSET(B389,-1,0),C389)","v":3},{"$f":"IF(OFFSET(C389,-1,0)=\"L\",1,IF(OFFSET(C389,-1,0)=1,2,IF(OR(A389=\"s\",A389=0),\"S\",IF(AND(OFFSET(C389,-1,0)=2,A389=4),3,IF(AND(OR(OFFSET(C389,-1,0)=\"s\",OFFSET(C389,-1,0)=0),A389<>\"s\",A389>OFFSET(B389,-1,0)),OFFSET(B389,-1,0),A389)))))","v":"S"},{"$f":"IF(OR(C389=\"S\",C389=0),0,IF(ISERROR(K389),J389,SMALL(J389:K389,1)))","v":0},{"$f":"IF($C389=1,OFFSET(E389,-1,0)+1,OFFSET(E389,-1,0))","v":1},{"$f":"IF($C389=1,0,IF($C389=2,OFFSET(F389,-1,0)+1,OFFSET(F389,-1,0)))","v":16},{"$f":"IF(AND($C389<=2,$C389<>0),0,IF($C389=3,OFFSET(G389,-1,0)+1,OFFSET(G389,-1,0)))","v":2},{"$f":"IF(AND($C389<=3,$C389<>0),0,IF($C389=4,OFFSET(H389,-1,0)+1,OFFSET(H389,-1,0)))","v":0},0,0,0,{"$f":"IF(OR(W389>0,$C389=1),\"F\",\"\")","v":""},"Serviço","Serviço","-","AGETOP",221102,"RODAPÉ FUNDIDO DE GRANITINA 7CM","m     ",164.2,null,null,0,""]
["S",3,"S",0,1,16,2,0,0,0,0,"","Serviço","Serviço","-","AGETOP",221104,"RASPAGEM E APLICAÇÃO RESINA ACRÍLICA DUAS DEMÃOS","m2    ",200.32400000000001,null,null,0,""]
[3,{"$f":"IF(OR(C391=\"s\",C391=0),OFFSET(B391,-1,0),C391)","v":3},{"$f":"IF(OFFSET(C391,-1,0)=\"L\",1,IF(OFFSET(C391,-1,0)=1,2,IF(OR(A391=\"s\",A391=0),\"S\",IF(AND(OFFSET(C391,-1,0)=2,A391=4),3,IF(AND(OR(OFFSET(C391,-1,0)=\"s\",OFFSET(C391,-1,0)=0),A391<>\"s\",A391>OFFSET(B391,-1,0)),OFFSET(B391,-1,0),A391)))))","v":3},{"$f":"IF(OR(C391=\"S\",C391=0),0,IF(ISERROR(K391),J391,SMALL(J391:K391,1)))","v":2},{"$f":"IF($C391=1,OFFSET(E391,-1,0)+1,OFFSET(E391,-1,0))","v":1},{"$f":"IF($C391=1,0,IF($C391=2,OFFSET(F391,-1,0)+1,OFFSET(F391,-1,0)))","v":16},{"$f":"IF(AND($C391<=2,$C391<>0),0,IF($C391=3,OFFSET(G391,-1,0)+1,OFFSET(G391,-1,0)))","v":3},{"$f":"IF(AND($C391<=3,$C391<>0),0,IF($C391=4,OFFSET(H391,-1,0)+1,OFFSET(H391,-1,0)))","v":0},0,6,2,{"$f":"IF(OR(W391>0,$C391=1),\"F\",\"\")","v":""},"Nível 3","Nível 3","-","SINAPI",null,"COZINHA","-",null,null,null,0,""]
["S",3,"S",0,1,16,3,0,0,0,0,"","Serviço","Serviço","-","AGETOP",220309,"PISO EM CERÂMICA PEI MAIOR OU IGUAL A 4 COM CONTRA PISO (1CI:3ARML) E ARGAMASSA COLANTE","m2    ",80.2,null,null,0,""]
[3,3,3,4,1,16,4,0,0,4,{"$error":"#N/A"},"","Nível 3","Nível 3","-","SINAPI",null,"PISO PATIO COBERTO","-",null,null,null,0,""]
["S",3,"S",0,1,16,4,0,0,0,0,"","Serviço","Serviço","-","AGETOP",221101,"GRANITINA 8MM FUNDIDA COM CONTRAPISO (1CI:3ARML) E=2CM E JUNTA PLASTICA 27MM","m2    ",297.04000000000002,null,null,0,""]
["S",{"$f":"IF(OR(C395=\"s\",C395=0),OFFSET(B395,-1,0),C395)","v":3},{"$f":"IF(OFFSET(C395,-1,0)=\"L\",1,IF(OFFSET(C395,-1,0)=1,2,IF(OR(A395=\"s\",A395=0),\"S\",IF(AND(OFFSET(C395,-1,0)=2,A395=4),3,IF(AND(OR(OFFSET(C395,-1,0)=\"s\",OFFSET(C395,-1,0)=0),A395<>\"s\",A395>OFFSET(B395,-1,0)),OFFSET(B395,-1,0),A395)))))","v":"S"},{"$f":"IF(OR(C395=\"S\",C395=0),0,IF(ISERROR(K395),J395,SMALL(J395:K395,1)))","v":0},{"$f":"IF($C395=1,OFFSET(E395,-1,0)+1,OFFSET(E395,-1,0))","v":1},{"$f":"IF($C395=1,0,IF($C395=2,OFFSET(F395,-1,0)+1,OFFSET(F395,-1,0)))","v":16},{"$f":"IF(AND($C395<=2,$C395<>0),0,IF($C395=3,OFFSET(G395,-1,0)+1,OFFSET(G395,-1,0)))","v":4},{"$f":"IF(AND($C395<=3,$C395<>0),0,IF($C395=4,OFFSET(H395,-1,0)+1,OFFSET(H395,-1,0)))","v":0},0,0,0,{"$f":"IF(OR(W395>0,$C395=1),\"F\",\"\")","v":""},"Serviço","Serviço","-","AGETOP",221102,"RODAPÉ FUNDIDO DE GRANITINA 7CM","m     ",13.66,null,null,0,""]
["S",3,"S",0,1,16,4,0,0,0,0,"","Serviço","Serviço","-","AGETOP",221104,"RASPAGEM E APLICAÇÃO RESINA ACRÍLICA DUAS DEMÃOS","m2    ",297.99620000000004,null,null,0,""]
[2,2,2,3,1,17,0,0,0,34,3,"","Nível 2","Nível 2","-","SINAPI",null,"FERRAGENS","-",null,null,null,0,""]
["S",2,"S",0,1,17,0,0,0,0,0,"","Serviço","Serviço","-","AGETOP",230174,"BARRA DE APOIO EM AÇO INOX - 40 CM","un    ",6,null,null,0,""]
["S",2,"S",0,1,17,0,0,0,0,0,"","Serviço","Serviço","-","AGETOP",230176,"BARRA DE APOIO EM AÇO INOX - 80 CM ","un    ",6,null,null,0,""]
[2,2,2,6,1,18,0,0,0,31,6,"","Nível 2","Nível 2","-",null,null,"ADMINISTRAÇÃO","-",null,null,null,0,""]
[3,3,3,3,1,18,1,0,0,5,3,"","Nível 3","Nível 3","-",null,null,"MENSALISTAS","-",null,null,null,0,""]
["S",3,"S",0,1,18,1,0,0,0,0,"","Serviço","Serviço","-","SINAPI",90778,"ENGENHEIRO CIVIL DE OBRA PLENO COM ENCARGOS COMPLEMENTARES","H",132,null,null,0,"Referência: AGETOP - 250101"]
["S",3,"S",0,1,18,1,0,0,{"$f":"IF(OR($C403=\"S\",$C403=0),0,MATCH(0,OFFSET($D403,1,$C403,ROW($C$431)-ROW($C403)),0))","v":0},{"$f":"IF(OR($C403=\"S\",$C403=0),0,MATCH(OFFSET($D403,0,$C403)+1,OFFSET($D403,1,$C403,ROW($C$431)-ROW($C403)),0))","v":0},"","Serviço","Serviço","-","SINAPI",90776,"ENCARREGADO GERAL COM ENCARGOS COMPLEMENTARES","H",660,null,null,0,"Referência: AGETOP - 250103"]
[3,3,3,2,1,18,2,0,0,2,12,"","Nível 3","Nível 3","-",null,null,"LAUDO DE ESTANQUEIDADE","-",null,null,null,0,""]
["S",3,"S",0,1,18,2,0,0,0,0,"","Serviço","Serviço","-","SINAPI",90778,"ENGENHEIRO CIVIL DE OBRA PLENO COM ENCARGOS COMPLEMENTARES","H",16,null,null,0,"Referência: AGETOP - 250101"]
[2,2,2,16,1,19,0,0,0,25,16,"","Nível 2","Nível 2","-",null,null,"PINTURA","-",null,null,null,0,""]
[3,{"$f":"IF(OR(C407=\"s\",C407=0),OFFSET(B407,-1,0),C407)","v":3},{"$f":"IF(OFFSET(C407,-1,0)=\"L\",1,IF(OFFSET(C407,-1,0)=1,2,IF(OR(A407=\"s\",A407=0),\"S\",IF(AND(OFFSET(C407,-1,0)=2,A407=4),3,IF(AND(OR(OFFSET(C407,-1,0)=\"s\",OFFSET(C407,-1,0)=0),A407<>\"s\",A407>OFFSET(B407,-1,0)),OFFSET(B407,-1,0),A407)))))","v":3},{"$f":"IF(OR(C407=\"S\",C407=0),0,IF(ISERROR(K407),J407,SMALL(J407:K407,1)))","v":4},{"$f":"IF($C407=1,OFFSET(E407,-1,0)+1,OFFSET(E407,-1,0))","v":1},{"$f":"IF($C407=1,0,IF($C407=2,OFFSET(F407,-1,0)+1,OFFSET(F407,-1,0)))","v":19},{"$f":"IF(AND($C407<=2,$C407<>0),0,IF($C407=3,OFFSET(G407,-1,0)+1,OFFSET(G407,-1,0)))","v":1},{"$f":"IF(AND($C407<=3,$C407<>0),0,IF($C407=4,OFFSET(H407,-1,0)+1,OFFSET(H407,-1,0)))","v":0},0,15,4,{"$f":"IF(OR(W407>0,$C407=1),\"F\",\"\")","v":""},"Nível 3","Nível 3","-","SINAPI",null,"MURO","-",null,null,null,0,""]
["S",{"$f":"IF(OR(C408=\"s\",C408=0),OFFSET(B408,-1,0),C408)","v":3},{"$f":"IF(OFFSET(C408,-1,0)=\"L\",1,IF(OFFSET(C408,-1,0)=1,2,IF(OR(A408=\"s\",A408=0),\"S\",IF(AND(OFFSET(C408,-1,0)=2,A408=4),3,IF(AND(OR(OFFSET(C408,-1,0)=\"s\",OFFSET(C408,-1,0)=0),A408<>\"s\",A408>OFFSET(B408,-1,0)),OFFSET(B408,-1,0),A408)))))","v":"S"},{"$f":"IF(OR(C408=\"S\",C408=0),0,IF(ISERROR(K408),J408,SMALL(J408:K408,1)))","v":0},{"$f":"IF($C408=1,OFFSET(E408,-1,0)+1,OFFSET(E408,-1,0))","v":1},{"$f":"IF($C408=1,0,IF($C408=2,OFFSET(F408,-1,0)+1,OFFSET(F408,-1,0)))","v":19},{"$f":"IF(AND($C408<=2,$C408<>0),0,IF($C408=3,OFFSET(G408,-1,0)+1,OFFSET(G408,-1,0)))","v":1},{"$f":"IF(AND($C408<=3,$C408<>0),0,IF($C408=4,OFFSET(H408,-1,0)+1,OFFSET(H408,-1,0)))","v":0},0,0,0,{"$f":"IF(OR(W408>0,$C408=1),\"F\",\"\")","v":""},"Serviço","Serviço","-","AGETOP",261620,"LETREIRO MÉDIO A GRANDE PORTE EM PAREDE FEITO A PINCEL","m2    ",7.2,null,null,0,""]
["S",{"$f":"IF(OR(C409=\"s\",C409=0),OFFSET(B409,-1,0),C409)","v":3},{"$f":"IF(OFFSET(C409,-1,0)=\"L\",1,IF(OFFSET(C409,-1,0)=1,2,IF(OR(A409=\"s\",A409=0),\"S\",IF(AND(OFFSET(C409,-1,0)=2,A409=4),3,IF(AND(OR(OFFSET(C409,-1,0)=\"s\",OFFSET(C409,-1,0)=0),A409<>\"s\",A409>OFFSET(B409,-1,0)),OFFSET(B409,-1,0),A409)))))","v":"S"},{"$f":"IF(OR(C409=\"S\",C409=0),0,IF(ISERROR(K409),J409,SMALL(J409:K409,1)))","v":0},{"$f":"IF($C409=1,OFFSET(E409,-1,0)+1,OFFSET(E409,-1,0))","v":1},{"$f":"IF($C409=1,0,IF($C409=2,OFFSET(F409,-1,0)+1,OFFSET(F409,-1,0)))","v":19},{"$f":"IF(AND($C409<=2,$C409<>0),0,IF($C409=3,OFFSET(G409,-1,0)+1,OFFSET(G409,-1,0)))","v":1},{"$f":"IF(AND($C409<=3,$C409<>0),0,IF($C409=4,OFFSET(H409,-1,0)+1,OFFSET(H409,-1,0)))","v":0},0,0,0,{"$f":"IF(OR(W409>0,$C409=1),\"F\",\"\")","v":""},"Serviço","Serviço","-","AGETOP",261000,"PINTURA LATEX ACRILICA 2 DEMAOS C/SELADOR","m2    ",1371.09,null,null,0,""]
["S",{"$f":"IF(OR(C410=\"s\",C410=0),OFFSET(B410,-1,0),C410)","v":3},{"$f":"IF(OFFSET(C410,-1,0)=\"L\",1,IF(OFFSET(C410,-1,0)=1,2,IF(OR(A410=\"s\",A410=0),\"S\",IF(AND(OFFSET(C410,-1,0)=2,A410=4),3,IF(AND(OR(OFFSET(C410,-1,0)=\"s\",OFFSET(C410,-1,0)=0),A410<>\"s\",A410>OFFSET(B410,-1,0)),OFFSET(B410,-1,0),A410)))))","v":"S"},{"$f":"IF(OR(C410=\"S\",C410=0),0,IF(ISERROR(K410),J410,SMALL(J410:K410,1)))","v":0},{"$f":"IF($C410=1,OFFSET(E410,-1,0)+1,OFFSET(E410,-1,0))","v":1},{"$f":"IF($C410=1,0,IF($C410=2,OFFSET(F410,-1,0)+1,OFFSET(F410,-1,0)))","v":19},{"$f":"IF(AND($C410<=2,$C410<>0),0,IF($C410=3,OFFSET(G410,-1,0)+1,OFFSET(G410,-1,0)))","v":1},{"$f":"IF(AND($C410<=3,$C410<>0),0,IF($C410=4,OFFSET(H410,-1,0)+1,OFFSET(H410,-1,0)))","v":0},0,0,0,{"$f":"IF(OR(W410>0,$C410=1),\"F\",\"\")","v":""},"Serviço","Serviço","-","AGETOP",261304,"EMASSAMENTO ACRILICO 2 DEMAOS","m2    ",5.76,null,null,0,""]
[3,{"$f":"IF(OR(C411=\"s\",C411=0),OFFSET(B411,-1,0),C411)","v":3},{"$f":"IF(OFFSET(C411,-1,0)=\"L\",1,IF(OFFSET(C411,-1,0)=1,2,IF(OR(A411=\"s\",A411=0),\"S\",IF(AND(OFFSET(C411,-1,0)=2,A411=4),3,IF(AND(OR(OFFSET(C411,-1,0)=\"s\",OFFSET(C411,-1,0)=0),A411<>\"s\",A411>OFFSET(B411,-1,0)),OFFSET(B411,-1,0),A411)))))","v":3},{"$f":"IF(OR(C411=\"S\",C411=0),0,IF(ISERROR(K411),J411,SMALL(J411:K411,1)))","v":5},{"$f":"IF($C411=1,OFFSET(E411,-1,0)+1,OFFSET(E411,-1,0))","v":1},{"$f":"IF($C411=1,0,IF($C411=2,OFFSET(F411,-1,0)+1,OFFSET(F411,-1,0)))","v":19},{"$f":"IF(AND($C411<=2,$C411<>0),0,IF($C411=3,OFFSET(G411,-1,0)+1,OFFSET(G411,-1,0)))","v":2},{"$f":"IF(AND($C411<=3,$C411<>0),0,IF($C411=4,OFFSET(H411,-1,0)+1,OFFSET(H411,-1,0)))","v":0},0,11,5,{"$f":"IF(OR(W411>0,$C411=1),\"F\",\"\")","v":""},"Nível 3","Nível 3","-","SINAPI",null,"PAREDES","-",null,null,null,0,""]
["S",{"$f":"IF(OR(C412=\"s\",C412=0),OFFSET(B412,-1,0),C412)","v":3},{"$f":"IF(OFFSET(C412,-1,0)=\"L\",1,IF(OFFSET(C412,-1,0)=1,2,IF(OR(A412=\"s\",A412=0),\"S\",IF(AND(OFFSET(C412,-1,0)=2,A412=4),3,IF(AND(OR(OFFSET(C412,-1,0)=\"s\",OFFSET(C412,-1,0)=0),A412<>\"s\",A412>OFFSET(B412,-1,0)),OFFSET(B412,-1,0),A412)))))","v":"S"},{"$f":"IF(OR(C412=\"S\",C412=0),0,IF(ISERROR(K412),J412,SMALL(J412:K412,1)))","v":0},{"$f":"IF($C412=1,OFFSET(E412,-1,0)+1,OFFSET(E412,-1,0))","v":1},{"$f":"IF($C412=1,0,IF($C412=2,OFFSET(F412,-1,0)+1,OFFSET(F412,-1,0)))","v":19},{"$f":"IF(AND($C412<=2,$C412<>0),0,IF($C412=3,OFFSET(G412,-1,0)+1,OFFSET(G412,-1,0)))","v":2},{"$f":"IF(AND($C412<=3,$C412<>0),0,IF($C412=4,OFFSET(H412,-1,0)+1,OFFSET(H412,-1,0)))","v":0},0,0,0,{"$f":"IF(OR(W412>0,$C412=1),\"F\",\"\")","v":""},"Serviço","Serviço","-","AGETOP",260104,"REMOCAO DE PINTURA ANTIGA A LATEX","m2    ",1052.6500000000001,null,null,0,""]
["S",3,"S",0,1,19,2,0,0,0,0,"","Serviço","Serviço","-","AGETOP",261304,"EMASSAMENTO ACRILICO 2 DEMAOS","m2    ",1052.6500000000001,null,null,0,""]
["S",3,"S",0,1,19,2,0,0,0,0,"","Serviço","Serviço","-","AGETOP",261000,"PINTURA LATEX ACRILICA 2 DEMAOS C/SELADOR","m2    ",2826.58,null,null,0,""]
["S",3,"S",0,1,19,2,0,0,0,0,"","Serviço","Serviço","-","AGETOP",261550,"PINT.ESMALTE SINT.PAREDES - 2 DEM.C/SELADOR","m2    ",3024.3,null,null,0,""]
[3,{"$f":"IF(OR(C416=\"s\",C416=0),OFFSET(B416,-1,0),C416)","v":3},{"$f":"IF(OFFSET(C416,-1,0)=\"L\",1,IF(OFFSET(C416,-1,0)=1,2,IF(OR(A416=\"s\",A416=0),\"S\",IF(AND(OFFSET(C416,-1,0)=2,A416=4),3,IF(AND(OR(OFFSET(C416,-1,0)=\"s\",OFFSET(C416,-1,0)=0),A416<>\"s\",A416>OFFSET(B416,-1,0)),OFFSET(B416,-1,0),A416)))))","v":3},{"$f":"IF(OR(C416=\"S\",C416=0),0,IF(ISERROR(K416),J416,SMALL(J416:K416,1)))","v":4},{"$f":"IF($C416=1,OFFSET(E416,-1,0)+1,OFFSET(E416,-1,0))","v":1},{"$f":"IF($C416=1,0,IF($C416=2,OFFSET(F416,-1,0)+1,OFFSET(F416,-1,0)))","v":19},{"$f":"IF(AND($C416<=2,$C416<>0),0,IF($C416=3,OFFSET(G416,-1,0)+1,OFFSET(G416,-1,0)))","v":3},{"$f":"IF(AND($C416<=3,$C416<>0),0,IF($C416=4,OFFSET(H416,-1,0)+1,OFFSET(H416,-1,0)))","v":0},0,6,4,{"$f":"IF(OR(W416>0,$C416=1),\"F\",\"\")","v":""},"Nível 3","Nível 3","-","SINAPI",null,"ESQUADRIAS","-",null,null,null,0,""]
["S",{"$f":"IF(OR(C417=\"s\",C417=0),OFFSET(B417,-1,0),C417)","v":3},{"$f":"IF(OFFSET(C417,-1,0)=\"L\",1,IF(OFFSET(C417,-1,0)=1,2,IF(OR(A417=\"s\",A417=0),\"S\",IF(AND(OFFSET(C417,-1,0)=2,A417=4),3,IF(AND(OR(OFFSET(C417,-1,0)=\"s\",OFFSET(C417,-1,0)=0),A417<>\"s\",A417>OFFSET(B417,-1,0)),OFFSET(B417,-1,0),A417)))))","v":"S"},{"$f":"IF(OR(C417=\"S\",C417=0),0,IF(ISERROR(K417),J417,SMALL(J417:K417,1)))","v":0},{"$f":"IF($C417=1,OFFSET(E417,-1,0)+1,OFFSET(E417,-1,0))","v":1},{"$f":"IF($C417=1,0,IF($C417=2,OFFSET(F417,-1,0)+1,OFFSET(F417,-1,0)))","v":19},{"$f":"IF(AND($C417<=2,$C417<>0),0,IF($C417=3,OFFSET(G417,-1,0)+1,OFFSET(G417,-1,0)))","v":3},{"$f":"IF(AND($C417<=3,$C417<>0),0,IF($C417=4,OFFSET(H417,-1,0)+1,OFFSET(H417,-1,0)))","v":0},0,0,0,{"$f":"IF(OR(W417>0,$C417=1),\"F\",\"\")","v":""},"Serviço","Serviço","-","AGETOP",260105,"REMOCAO DE PINTURA ANTIGA A OLEO OU ESMALTE","m2    ",663.6,null,null,0,""]
["S",3,"S",0,1,19,3,0,0,0,0,"","Serviço","Serviço","-","AGETOP",261503,"PINT.ESMALTE 2 DEM. ESQ.FERRO (SEM FUNDO ANTICOR.)","m2    ",663.6,null,null,0,""]
["S",3,"S",0,1,19,3,0,0,0,0,"","Serviço","Serviço","-","AGETOP",261602,"PINT.ESMALTE/ESQUAD.FERRO C/FUNDO ANTICOR.","m2    ",142.24,null,null,0,""]
[3,3,3,2,1,19,4,0,0,{"$f":"IF(OR($C420=\"S\",$C420=0),0,MATCH(0,OFFSET($D420,1,$C420,ROW($C$431)-ROW($C420)),0))","v":2},{"$f":"IF(OR($C420=\"S\",$C420=0),0,MATCH(OFFSET($D420,0,$C420)+1,OFFSET($D420,1,$C420,ROW($C$431)-ROW($C420)),0))","v":{"$error":"#N/A"}},"","Nível 3","Nível 3","-","SINAPI",null,"ESTRUTURA METÁLICA","-",null,null,null,0,""]
["S",3,"S",0,1,19,4,0,0,0,0,"","Serviço","Serviço","-","AGETOP",261609,"PINTURA ESMALTE ALQUIDICO ESTR.METALICA 2 DEMAOS","m2    ",1242.51,null,null,0,""]
[{"$f":"CHOOSE(1+LOG(1+2*(ORÇAMENTO.Nivel=\"Nível 1\")+4*(ORÇAMENTO.Nivel=\"Nível 2\")+8*(ORÇAMENTO.Nivel=\"Nível 3\")+16*(ORÇAMENTO.Nivel=\"Nível 4\")+32*(ORÇAMENTO.Nivel=\"Serviço\"),2),0,1,2,3,4,\"S\")","v":2},{"$f":"IF(OR(C422=\"s\",C422=0),OFFSET(B422,-1,0),C422)","v":2},{"$f":"IF(OFFSET(C422,-1,0)=\"L\",1,IF(OFFSET(C422,-1,0)=1,2,IF(OR(A422=\"s\",A422=0),\"S\",IF(AND(OFFSET(C422,-1,0)=2,A422=4),3,IF(AND(OR(OFFSET(C422,-1,0)=\"s\",OFFSET(C422,-1,0)=0),A422<>\"s\",A422>OFFSET(B422,-1,0)),OFFSET(B422,-1,0),A422)))))","v":2},{"$f":"IF(OR(C422=\"S\",C422=0),0,IF(ISERROR(K422),J422,SMALL(J422:K422,1)))","v":9},{"$f":"IF($C422=1,OFFSET(E422,-1,0)+1,OFFSET(E422,-1,0))","v":1},{"$f":"IF($C422=1,0,IF($C422=2,OFFSET(F422,-1,0)+1,OFFSET(F422,-1,0)))","v":20},{"$f":"IF(AND($C422<=2,$C422<>0),0,IF($C422=3,OFFSET(G422,-1,0)+1,OFFSET(G422,-1,0)))","v":0},{"$f":"IF(AND($C422<=3,$C422<>0),0,IF($C422=4,OFFSET(H422,-1,0)+1,OFFSET(H422,-1,0)))","v":0},{"$f":"IF(AND($C422<=4,$C422<>0),0,IF(AND($C422=\"S\",$W422>0),OFFSET(I422,-1,0)+1,OFFSET(I422,-1,0)))","v":0},{"$f":"IF(OR($C422=\"S\",$C422=0),0,MATCH(0,OFFSET($D422,1,$C422,ROW($C$431)-ROW($C422)),0))","v":9},{"$f":"IF(OR($C422=\"S\",$C422=0),0,MATCH(OFFSET($D422,0,$C422)+1,OFFSET($D422,1,$C422,ROW($C$431)-ROW($C422)),0))","v":{"$error":"#N/A"}},{"$f":"IF(OR(W422>0,$C422=1),\"F\",\"\")","v":""},"Nível 2","Nível 2","-",null,null,"DIVERSOS","-",null,null,null,0,""]
[3,3,3,2,1,20,1,0,0,{"$f":"IF(OR($C423=\"S\",$C423=0),0,MATCH(0,OFFSET($D423,1,$C423,ROW($C$431)-ROW($C423)),0))","v":8},{"$f":"IF(OR($C423=\"S\",$C423=0),0,MATCH(OFFSET($D423,0,$C423)+1,OFFSET($D423,1,$C423,ROW($C$431)-ROW($C423)),0))","v":2},"","Nível 3","Nível 3","-","SINAPI",null,"BANHEIROS / VESTIÁRIOS","-",null,null,null,0,""]
["S",3,"S",0,1,20,1,0,0,{"$f":"IF(OR($C424=\"S\",$C424=0),0,MATCH(0,OFFSET($D424,1,$C424,ROW($C$431)-ROW($C424)),0))","v":0},{"$f":"IF(OR($C424=\"S\",$C424=0),0,MATCH(OFFSET($D424,0,$C424)+1,OFFSET($D424,1,$C424,ROW($C$431)-ROW($C424)),0))","v":0},"","Serviço","Serviço","-","AGETOP",271608,"BANCADA DE GRANITO C/ESPELHO","m2    ",4.8,null,null,0,""]
[3,3,3,2,1,20,2,0,0,{"$f":"IF(OR($C425=\"S\",$C425=0),0,MATCH(0,OFFSET($D425,1,$C425,ROW($C$431)-ROW($C425)),0))","v":6},{"$f":"IF(OR($C425=\"S\",$C425=0),0,MATCH(OFFSET($D425,0,$C425)+1,OFFSET($D425,1,$C425,ROW($C$431)-ROW($C425)),0))","v":2},"","Nível 3","Nível 3","-","SINAPI",null,"SECRETARIA","-",null,null,null,0,""]
["S",3,"S",0,1,20,2,0,0,0,0,"","Serviço","Serviço","-","AGETOP",271608,"BANCADA DE GRANITO C/ESPELHO","m2    ",0.36,null,null,0,""]
[3,3,3,2,1,20,3,0,0,{"$f":"IF(OR($C427=\"S\",$C427=0),0,MATCH(0,OFFSET($D427,1,$C427,ROW($C$431)-ROW($C427)),0))","v":4},{"$f":"IF(OR($C427=\"S\",$C427=0),0,MATCH(OFFSET($D427,0,$C427)+1,OFFSET($D427,1,$C427,ROW($C$431)-ROW($C427)),0))","v":2},"","Nível 3","Nível 3","-","SINAPI",null,"READEQUAÇÕES DA COZINHA","-",null,null,null,0,""]
["S",3,"S",0,1,20,3,0,0,{"$f":"IF(OR($C428=\"S\",$C428=0),0,MATCH(0,OFFSET($D428,1,$C428,ROW($C$431)-ROW($C428)),0))","v":0},{"$f":"IF(OR($C428=\"S\",$C428=0),0,MATCH(OFFSET($D428,0,$C428)+1,OFFSET($D428,1,$C428,ROW($C$431)-ROW($C428)),0))","v":0},"","Serviço","Serviço","-","AGETOP",271608,"BANCADA DE GRANITO C/ESPELHO","m2    ",10.63,null,null,0,""]
[3,3,3,2,1,20,4,0,0,{"$f":"IF(OR($C429=\"S\",$C429=0),0,MATCH(0,OFFSET($D429,1,$C429,ROW($C$431)-ROW($C429)),0))","v":2},{"$f":"IF(OR($C429=\"S\",$C429=0),0,MATCH(OFFSET($D429,0,$C429)+1,OFFSET($D429,1,$C429,ROW($C$431)-ROW($C429)),0))","v":{"$error":"#N/A"}},"","Nível 3","Nível 3","-","SINAPI",null,"REFORMA GERAL","-",null,null,null,0,""]
["S",3,"S",0,1,20,4,0,0,{"$f":"IF(OR($C430=\"S\",$C430=0),0,MATCH(0,OFFSET($D430,1,$C430,ROW($C$431)-ROW($C430)),0))","v":0},{"$f":"IF(OR($C430=\"S\",$C430=0),0,MATCH(OFFSET($D430,0,$C430)+1,OFFSET($D430,1,$C430,ROW($C$431)-ROW($C430)),0))","v":0},"","Serviço","Serviço","-","AGETOP",270501,"LIMPEZA FINAL DE OBRA - (OBRAS CIVIS)","m2    ",400,null,null,0,""]
[-1,null,-1,null,0,0,0,0,0,null,null,"F"]
[null,null,null,null,null,null,null,null,null,null,null,"F",null,null,null,null,null,"OBS: OS QUANTITATIVOS DE MATERIAIS  DAS INSTALAÇÕES HIDROSSANITÁRIAS, ELÉTRICAS E ESPECIAIS SÃO FORNECIDOS PELOS PROFISSIONAIS RESPONSÁVEIS PELOS RESPECTIVOS PROJETOS.",null,null,"VALOR TOTAL",null,{"$f":"SUMIF(C19:C431,\"2\",W19:W431)","v":0}]
[null,null,null,null,null,null,null,null,null,null,null,"F",null,null,null,null,null,null,null,null,{"$f":"CONCATENATE(\"VALOR BDI (\",TEXT(BDI.Taxa*100,\"00,00\"),\"%)\")","v":"VALOR BDI (20,34%)"},null,{"$f":"ROUND(W432*BDI.Taxa,2)","v":0}]
[null,null,null,null,null,null,null,null,null,null,null,"F",null,null,null,null,null,null,null,null,"TOTAL ORÇAMENTO",null,{"$f":"W432+W433","v":0}]
[null,null,null,null,null,null,null,null,null,null,null,"F"]
[null,null,null,null,null,null,null,null,null,null,null,"F",null,null,null,null,null,null,null,null,"CUSTO POR M2 ³",null,{"$f":"IFERROR($W$434/$S$13,0)","v":0}]
[null,null,null,null,null,null,null,null,null,null,null,"F",null,null,null,null,null,null,null,null,"MATERIAL S/ BDI",null,{"$f":"ROUND(SUMPRODUCT(T63:T431,U63:U431),2)","v":0}]
[null,null,null,null,null,null,null,null,null,null,null,"F",null,null,null,null,null,null,null,null,"MÃO DE OBRA S/ BDI",null,{"$f":"W432-W437","v":0}]
[null,null,null,null,null,null,null,null,null,null,null,"F"]
[null,null,null,null,null,null,null,null,null,null,null,"F",null,null,null,null,"(1) Conforme previsto pelo DECRETO Nº 7.983, DE 8 DE ABRIL DE 2013, os preços adotados são aqueles constantes dos sistemas de referência indicados. Justifica-se o uso dos preços destas composições de custos unitários devido ao seu valor ser menor à mediana de seus correspondentes na tabela SINAPI;"]
[null,null,null,null,null,null,null,null,null,null,null,"F",null,null,null,null,"(2) Optou-se pelo uso das composições de custos da AGETOP para itens não presentes na SINAPI;"]
[null,null,null,null,null,null,null,null,null,null,null,"F",null,null,null,null,"(3) Para itens da AGETOP, os vidros não estão inclusos nas esquadrias e já foram considerados os custos de contramarco para as esquadrias de alumínio;"]
[null,null,null,null,null,null,null,null,null,null,null,"F",null,null,null,null,"(4) Nos casos em que houver execução de granitina e omissão do item AGETOP 221102, considerou-se que o quantitativo para o rodapé, de altura igual a 7cm, foi incorporado na área de piso;"]
[null,null,null,null,null,null,null,null,null,null,null,"F",null,null,null,null,"(5) O custo unitário aproximado por metro quadrado é calculado dividindo-se o valor total do orçamento pela área total de construção."]
[null,null,null,null,null,null,null,null,null,null,null,"F"]
[null,null,null,null,null,null,null,null,null,null,null,"F"]
[]
[null,null,null,null,null,null,null,null,null,null,null,null,null,null,"SOMATÓRIO DE SERVIÇOS"]
[null,null,null,null,null,null,null,null,null,null,null,null,null,null,"ITEM","DESCRIÇÃO DOS SERVIÇOS",null,null,"PREÇO SEM BDI",null,null,"PREÇO COM BDI",null,"PARTICIPAÇÃO ( % )"]
[null,null,null,null,null,null,null,null,null,null,null,null,null,null,"a.","SERVIÇOS PRELIMINARES",null,null,{"$f":"SUMIF($R$19:$R$431,$P450,$W$19:$W$431)","v":0},null,null,{"$f":"ROUND(S450*(1+BDI.Taxa),2)","v":0},null,{"$f":"IFERROR(ROUND($V450*100/$W$434,2),0)","v":0}]
[null,null,null,null,null,null,null,null,null,null,null,null,null,null,"b.","TRANSPORTES",null,null,0,null,null,0,null,{"$f":"IFERROR(ROUND($V451*100/$W$434,2),0)","v":0}]
[null,null,null,null,null,null,null,null,null,null,null,null,null,null,"c.","SERVIÇO EM TERRA",null,null,0,null,null,0,null,0]
[null,null,null,null,null,null,null,null,null,null,null,null,null,null,"d.","FUNDAÇÕES E SONDAGENS",null,null,0,null,null,0,null,0]
[null,null,null,null,null,null,null,null,null,null,null,null,null,null,"e.","ESTRUTURA",null,null,0,null,null,0,null,0]
[null,null,null,null,null,null,null,null,null,null,null,null,null,null,"f.","INSTALAÇÕES ELÉTRICAS",null,null,0,null,null,0,null,0]
[null,null,null,null,null,null,null,null,null,null,null,null,null,null,"g.","INSTALAÇÕES HIDROSSANITÁRIAS",null,null,0,null,null,0,null,0]
[null,null,null,null,null,null,null,null,null,null,null,null,null,null,"h","INSTALAÇÕES ESPECIAIS",null,null,0,null,null,0,null,0]
[null,null,null,null,null,null,null,null,null,null,null,null,null,null,"i.","ALVENARIAS E DIVISÓRIAS",null,null,0,null,null,0,null,0]
[null,null,null,null,null,null,null,null,null,null,null,null,null,null,"j.","ALVENARIA AUTO-PORTANTE",null,null,0,null,null,0,null,0]
[null,null,null,null,null,null,null,null,null,null,null,null,null,null,"k.","IMPERMEABILIZAÇÃO",null,null,0,null,null,0,null,0]
[null,null,null,null,null,null,null,null,null,null,null,null,null,null,"l.","ISOLAMENTO TÉRMICO E ACÚSTICO",null,null,0,null,null,0,null,0]
[null,null,null,null,null,null,null,null,null,null,null,null,null,null,"m.","ESTRUTURA DE MADEIRA",null,null,0,null,null,0,null,0]
[null,null,null,null,null,null,null,null,null,null,null,null,null,null,"n.","ESTRUTURAS METÁLICAS",null,null,0,null,null,0,null,0]
[null,null,null,null,null,null,null,null,null,null,null,null,null,null,"o.","COBERTURAS",null,null,0,null,null,0,null,0]
[null,null,null,null,null,null,null,null,null,null,null,null,null,null,"p.","ESQUADRIAS DE MADEIRA",null,null,0,null,null,0,null,0]
[null,null,null,null,null,null,null,null,null,null,null,null,null,null,"q.","ESQUADRIAS METÁLICAS",null,null,0,null,null,{"$f":"ROUND(S466*(1+BDI.Taxa),2)","v":0},null,0]
[null,null,null,null,null,null,null,null,null,null,null,null,null,null,"r.","VIDROS",null,null,0,null,null,0,null,0]
[null,null,null,null,null,null,null,null,null,null,null,null,null,null,"s.","REVESTIMENTO DE PAREDE",null,null,0,null,null,0,null,0]
[null,null,null,null,null,null,null,null,null,null,null,null,null,null,"t.","FORROS",null,null,0,null,null,0,null,0]
[null,null,null,null,null,null,null,null,null,null,null,null,null,null,"u.","REVESTIMENTO DE PISO",null,null,0,null,null,0,null,0]
[null,null,null,null,null,null,null,null,null,null,null,null,null,null,"v.","FERRAGENS",null,null,0,null,null,0,null,0]
[null,null,null,null,null,null,null,null,null,null,null,null,null,null,"w.","MARCENARIA",null,null,0,null,null,0,null,0]
[null,null,null,null,null,null,null,null,null,null,null,null,null,null,"x.","ADMINISTRAÇÃO",null,null,0,null,null,0,null,0]
[null,null,null,null,null,null,null,null,null,null,null,null,null,null,"y.","PINTURA",null,null,0,null,null,{"$f":"ROUND(S474*(1+BDI.Taxa),2)","v":0},null,0]
[null,null,null,null,null,null,null,null,null,null,null,null,null,null,"z.","DIVERSOS",null,null,0,null,null,{"$f":"IF(S475>0,IF((SUM(V450:W474)+ROUND(S475*(1+BDI.Taxa),2))<>V477,V477-SUM(V450:W474),ROUND(S475*(1+BDI.Taxa),2)),0)","v":0},null,{"$f":"IF(S475>0,IF((SUM(X450:X474)+IFERROR(ROUND($V475*100/$W$434,2),0))<>X477,X477-SUM(X450:X474),IFERROR(ROUND($V475*100/$W$434,2),0)),0)","v":0}]
[null,null,null,null,null,null,null,null,null,null,null,null,null,null,"TOTAL GERAL DO ORÇAMENTO (R$)",null,null,null,{"$f":"SUM(S450:U475)","v":0},null,null,{"$f":"SUM(V450:W475)","v":0},null,{"$f":"SUM(X450:X475)","v":0}]
[null,null,null,null,null,null,null,null,null,null,null,null,null,null,null,null,null,null,{"$f":"$W$432","v":0},null,null,{"$f":"$W$434","v":0},null,100]
[null,null,null,null,null,null,null,null,null,null,null,null,null,null,null,null,null,null,"(TOTAL SEM BDI)",null,null,"(TOTAL COM BDI)",null,"(ARRED porcentagem)"]
[null,null,null,null,null,null,null,null,null,null,null,null,null,null,null,null,null,null,{"$f":"IF(AND(S476=S477,S476>0),\"OK\",\"ERRO\")","v":"ERRO"},null,null,{"$f":"IF(AND(V476=V477,V476>0),\"OK\",\"ERRO\")","v":"ERRO"},null,{"$f":"IF(X476=100,\"OK\",\"ERRO\")","v":"ERRO"}]
[]
[]
[null,null,null,null,null,null,null,null,null,null,null,null,null,null,"RESUMO GERAL DO ORÇAMENTO"]
[null,null,null,null,null,null,null,null,null,null,null,null,null,null,"ITEM","DESCRIÇÃO DOS SERVIÇOS",null,null,"PREÇO SEM BDI",null,null,"PREÇO COM BDI",null,"PARTICIPAÇÃO ( % )"]
[null,null,null,null,null,null,null,null,null,null,null,null,null,null,"1.",{"$f":"IFERROR(VLOOKUP(O484,$O$19:$W$431,4,FALSE),\"\")","v":"REFORMA"},null,null,{"$f":"IF(P485=\"\",$S$505-SUM(OFFSET($S$483:S483,0,0,COUNTA($S$483:S483),1)),SUMIF($R$19:$R$431,$P484,$W$19:$W$431))","v":0},null,null,{"$f":"IF(P485=\"\",$V$505-SUM(OFFSET($V$483:V483,0,0,COUNTA($V$483:V483),1)),ROUND(S484*(1+BDI.Taxa),2))","v":0},null,{"$f":"IF(P485=\"\",$X$505-SUM(OFFSET($X$483:X483,0,0,COUNTA($X$483:X483),1)),ROUND(V484*100/ORÇAMENTO.TotalOrçamento,2))","v":100}]
[null,null,null,null,null,null,null,null,null,null,null,null,null,null,"2.","",null,null,{"$f":"IF(P486=\"\",$S$505-SUM(OFFSET($S$483:S484,0,0,COUNTA($S$483:S484),1)),SUMIF($R$19:$R$431,$P485,$W$19:$W$431))","v":0},null,null,{"$f":"IF(P486=\"\",$V$505-SUM(OFFSET($V$483:V484,0,0,COUNTA($V$483:V484),1)),ROUND(S485*(1+BDI.Taxa),2))","v":0},null,{"$f":"IF(P486=\"\",$X$505-SUM(OFFSET($X$483:X484,0,0,COUNTA($X$483:X484),1)),ROUND(V485*100/ORÇAMENTO.TotalOrçamento,2))","v":0}]
[null,null,null,null,null,null,null,null,null,null,null,null,null,null,"3.","",null,null,{"$f":"IF(P487=\"\",$S$505-SUM(OFFSET($S$483:S485,0,0,COUNTA($S$483:S485),1)),SUMIF($R$19:$R$431,$P486,$W$19:$W$431))","v":0},null,null,{"$f":"IF(P487=\"\",$V$505-SUM(OFFSET($V$483:V485,0,0,COUNTA($V$483:V485),1)),ROUND(S486*(1+BDI.Taxa),2))","v":0},null,{"$f":"IF(P487=\"\",$X$505-SUM(OFFSET($X$483:X485,0,0,COUNTA($X$483:X485),1)),ROUND(V486*100/ORÇAMENTO.TotalOrçamento,2))","v":0}]
[null,null,null,null,null,null,null,null,null,null,null,null,null,null,"4.","",null,null,{"$f":"IF(P488=\"\",$S$505-SUM(OFFSET($S$483:S486,0,0,COUNTA($S$483:S486),1)),SUMIF($R$19:$R$431,$P487,$W$19:$W$431))","v":0},null,null,{"$f":"IF(P488=\"\",$V$505-SUM(OFFSET($V$483:V486,0,0,COUNTA($V$483:V486),1)),ROUND(S487*(1+BDI.Taxa),2))","v":0},null,{"$f":"IF(P488=\"\",$X$505-SUM(OFFSET($X$483:X486,0,0,COUNTA($X$483:X486),1)),ROUND(V487*100/ORÇAMENTO.TotalOrçamento,2))","v":0}]
[null,null,null,null,null,null,null,null,null,null,null,null,null,null,"5.","",null,null,{"$f":"IF(P489=\"\",$S$505-SUM(OFFSET($S$483:S487,0,0,COUNTA($S$483:S487),1)),SUMIF($R$19:$R$431,$P488,$W$19:$W$431))","v":0},null,null,{"$f":"IF(P489=\"\",$V$505-SUM(OFFSET($V$483:V487,0,0,COUNTA($V$483:V487),1)),ROUND(S488*(1+BDI.Taxa),2))","v":0},null,{"$f":"IF(P489=\"\",$X$505-SUM(OFFSET($X$483:X487,0,0,COUNTA($X$483:X487),1)),ROUND(V488*100/ORÇAMENTO.TotalOrçamento,2))","v":0}]
[null,null,null,null,null,null,null,null,null,null,null,null,null,null,"6.","",null,null,{"$f":"IF(P490=\"\",$S$505-SUM(OFFSET($S$483:S488,0,0,COUNTA($S$483:S488),1)),SUMIF($R$19:$R$431,$P489,$W$19:$W$431))","v":0},null,null,{"$f":"IF(P490=\"\",$V$505-SUM(OFFSET($V$483:V488,0,0,COUNTA($V$483:V488),1)),ROUND(S489*(1+BDI.Taxa),2))","v":0},null,{"$f":"IF(P490=\"\",$X$505-SUM(OFFSET($X$483:X488,0,0,COUNTA($X$483:X488),1)),ROUND(V489*100/ORÇAMENTO.TotalOrçamento,2))","v":0}]
[null,null,null,null,null,null,null,null,null,null,null,null,null,null,"7.","",null,null,{"$f":"IF(P491=\"\",$S$505-SUM(OFFSET($S$483:S489,0,0,COUNTA($S$483:S489),1)),SUMIF($R$19:$R$431,$P490,$W$19:$W$431))","v":0},null,null,{"$f":"IF(P491=\"\",$V$505-SUM(OFFSET($V$483:V489,0,0,COUNTA($V$483:V489),1)),ROUND(S490*(1+BDI.Taxa),2))","v":0},null,{"$f":"IF(P491=\"\",$X$505-SUM(OFFSET($X$483:X489,0,0,COUNTA($X$483:X489),1)),ROUND(V490*100/ORÇAMENTO.TotalOrçamento,2))","v":0}]
[null,null,null,null,null,null,null,null,null,null,null,null,null,null,"8.","",null,null,{"$f":"IF(P492=\"\",$S$505-SUM(OFFSET($S$483:S490,0,0,COUNTA($S$483:S490),1)),SUMIF($R$19:$R$431,$P491,$W$19:$W$431))","v":0},null,null,{"$f":"IF(P492=\"\",$V$505-SUM(OFFSET($V$483:V490,0,0,COUNTA($V$483:V490),1)),ROUND(S491*(1+BDI.Taxa),2))","v":0},null,{"$f":"IF(P492=\"\",$X$505-SUM(OFFSET($X$483:X490,0,0,COUNTA($X$483:X490),1)),ROUND(V491*100/ORÇAMENTO.TotalOrçamento,2))","v":0}]
[null,null,null,null,null,null,null,null,null,null,null,null,null,null,"9.","",null,null,{"$f":"IF(P493=\"\",$S$505-SUM(OFFSET($S$483:S491,0,0,COUNTA($S$483:S491),1)),SUMIF($R$19:$R$431,$P492,$W$19:$W$431))","v":0},null,null,{"$f":"IF(P493=\"\",$V$505-SUM(OFFSET($V$483:V491,0,0,COUNTA($V$483:V491),1)),ROUND(S492*(1+BDI.Taxa),2))","v":0},null,{"$f":"IF(P493=\"\",$X$505-SUM(OFFSET($X$483:X491,0,0,COUNTA($X$483:X491),1)),ROUND(V492*100/ORÇAMENTO.TotalOrçamento,2))","v":0}]
[null,null,null,null,null,null,null,null,null,null,null,null,null,null,"10.","",null,null,{"$f":"IF(P494=\"\",$S$505-SUM(OFFSET($S$483:S492,0,0,COUNTA($S$483:S492),1)),SUMIF($R$19:$R$431,$P493,$W$19:$W$431))","v":0},null,null,{"$f":"IF(P494=\"\",$V$505-SUM(OFFSET($V$483:V492,0,0,COUNTA($V$483:V492),1)),ROUND(S493*(1+BDI.Taxa),2))","v":0},null,{"$f":"IF(P494=\"\",$X$505-SUM(OFFSET($X$483:X492,0,0,COUNTA($X$483:X492),1)),ROUND(V493*100/ORÇAMENTO.TotalOrçamento,2))","v":0}]
[null,null,null,null,null,null,null,null,null,null,null,null,null,null,"11.","",null,null,{"$f":"IF(P495=\"\",$S$505-SUM(OFFSET($S$483:S493,0,0,COUNTA($S$483:S493),1)),SUMIF($R$19:$R$431,$P494,$W$19:$W$431))","v":0},null,null,{"$f":"IF(P495=\"\",$V$505-SUM(OFFSET($V$483:V493,0,0,COUNTA($V$483:V493),1)),ROUND(S494*(1+BDI.Taxa),2))","v":0},null,{"$f":"IF(P495=\"\",$X$505-SUM(OFFSET($X$483:X493,0,0,COUNTA($X$483:X493),1)),ROUND(V494*100/ORÇAMENTO.TotalOrçamento,2))","v":0}]
[null,null,null,null,null,null,null,null,null,null,null,null,null,null,"12.","",null,null,{"$f":"IF(P496=\"\",$S$505-SUM(OFFSET($S$483:S494,0,0,COUNTA($S$483:S494),1)),SUMIF($R$19:$R$431,$P495,$W$19:$W$431))","v":0},null,null,{"$f":"IF(P496=\"\",$V$505-SUM(OFFSET($V$483:V494,0,0,COUNTA($V$483:V494),1)),ROUND(S495*(1+BDI.Taxa),2))","v":0},null,{"$f":"IF(P496=\"\",$X$505-SUM(OFFSET($X$483:X494,0,0,COUNTA($X$483:X494),1)),ROUND(V495*100/ORÇAMENTO.TotalOrçamento,2))","v":0}]
[null,null,null,null,null,null,null,null,null,null,null,null,null,null,"13.","",null,null,{"$f":"IF(P497=\"\",$S$505-SUM(OFFSET($S$483:S495,0,0,COUNTA($S$483:S495),1)),SUMIF($R$19:$R$431,$P496,$W$19:$W$431))","v":0},null,null,{"$f":"IF(P497=\"\",$V$505-SUM(OFFSET($V$483:V495,0,0,COUNTA($V$483:V495),1)),ROUND(S496*(1+BDI.Taxa),2))","v":0},null,{"$f":"IF(P497=\"\",$X$505-SUM(OFFSET($X$483:X495,0,0,COUNTA($X$483:X495),1)),ROUND(V496*100/ORÇAMENTO.TotalOrçamento,2))","v":0}]
[null,null,null,null,null,null,null,null,null,null,null,null,null,null,"14.","",null,null,{"$f":"IF(P498=\"\",$S$505-SUM(OFFSET($S$483:S496,0,0,COUNTA($S$483:S496),1)),SUMIF($R$19:$R$431,$P497,$W$19:$W$431))","v":0},null,null,{"$f":"IF(P498=\"\",$V$505-SUM(OFFSET($V$483:V496,0,0,COUNTA($V$483:V496),1)),ROUND(S497*(1+BDI.Taxa),2))","v":0},null,{"$f":"IF(P498=\"\",$X$505-SUM(OFFSET($X$483:X496,0,0,COUNTA($X$483:X496),1)),ROUND(V497*100/ORÇAMENTO.TotalOrçamento,2))","v":0}]
[null,null,null,null,null,null,null,null,null,null,null,null,null,null,"15.","",null,null,{"$f":"IF(P499=\"\",$S$505-SUM(OFFSET($S$483:S497,0,0,COUNTA($S$483:S497),1)),SUMIF($R$19:$R$431,$P498,$W$19:$W$431))","v":0},null,null,{"$f":"IF(P499=\"\",$V$505-SUM(OFFSET($V$483:V497,0,0,COUNTA($V$483:V497),1)),ROUND(S498*(1+BDI.Taxa),2))","v":0},null,{"$f":"IF(P499=\"\",$X$505-SUM(OFFSET($X$483:X497,0,0,COUNTA($X$483:X497),1)),ROUND(V498*100/ORÇAMENTO.TotalOrçamento,2))","v":0}]
[null,null,null,null,null,null,null,null,null,null,null,null,null,null,"16.","",null,null,{"$f":"IF(P500=\"\",$S$505-SUM(OFFSET($S$483:S498,0,0,COUNTA($S$483:S498),1)),SUMIF($R$19:$R$431,$P499,$W$19:$W$431))","v":0},null,null,{"$f":"IF(P500=\"\",$V$505-SUM(OFFSET($V$483:V498,0,0,COUNTA($V$483:V498),1)),ROUND(S499*(1+BDI.Taxa),2))","v":0},null,{"$f":"IF(P500=\"\",$X$505-SUM(OFFSET($X$483:X498,0,0,COUNTA($X$483:X498),1)),ROUND(V499*100/ORÇAMENTO.TotalOrçamento,2))","v":0}]
[null,null,null,null,null,null,null,null,null,null,null,null,null,null,"17.","",null,null,{"$f":"IF(P501=\"\",$S$505-SUM(OFFSET($S$483:S499,0,0,COUNTA($S$483:S499),1)),SUMIF($R$19:$R$431,$P500,$W$19:$W$431))","v":0},null,null,{"$f":"IF(P501=\"\",$V$505-SUM(OFFSET($V$483:V499,0,0,COUNTA($V$483:V499),1)),ROUND(S500*(1+BDI.Taxa),2))","v":0},null,{"$f":"IF(P501=\"\",$X$505-SUM(OFFSET($X$483:X499,0,0,COUNTA($X$483:X499),1)),ROUND(V500*100/ORÇAMENTO.TotalOrçamento,2))","v":0}]
[null,null,null,null,null,null,null,null,null,null,null,null,null,null,"18.","",null,null,{"$f":"IF(P502=\"\",$S$505-SUM(OFFSET($S$483:S500,0,0,COUNTA($S$483:S500),1)),SUMIF($R$19:$R$431,$P501,$W$19:$W$431))","v":0},null,null,{"$f":"IF(P502=\"\",$V$505-SUM(OFFSET($V$483:V500,0,0,COUNTA($V$483:V500),1)),ROUND(S501*(1+BDI.Taxa),2))","v":0},null,{"$f":"IF(P502=\"\",$X$505-SUM(OFFSET($X$483:X500,0,0,COUNTA($X$483:X500),1)),ROUND(V501*100/ORÇAMENTO.TotalOrçamento,2))","v":0}]
[null,null,null,null,null,null,null,null,null,null,null,null,null,null,"19.","",null,null,{"$f":"IF(P503=\"\",$S$505-SUM(OFFSET($S$483:S501,0,0,COUNTA($S$483:S501),1)),SUMIF($R$19:$R$431,$P502,$W$19:$W$431))","v":0},null,null,{"$f":"IF(P503=\"\",$V$505-SUM(OFFSET($V$483:V501,0,0,COUNTA($V$483:V501),1)),ROUND(S502*(1+BDI.Taxa),2))","v":0},null,{"$f":"IF(P503=\"\",$X$505-SUM(OFFSET($X$483:X501,0,0,COUNTA($X$483:X501),1)),ROUND(V502*100/ORÇAMENTO.TotalOrçamento,2))","v":0}]
[null,null,null,null,null,null,null,null,null,null,null,null,null,null,"20.","",null,null,{"$f":"IF(P504=\"\",$S$505-SUM(OFFSET($S$483:S502,0,0,COUNTA($S$483:S502),1)),SUMIF($R$19:$R$431,$P503,$W$19:$W$431))","v":0},null,null,{"$f":"IF(P504=\"\",$V$505-SUM(OFFSET($V$483:V502,0,0,COUNTA($V$483:V502),1)),ROUND(S503*(1+BDI.Taxa),2))","v":0},null,{"$f":"IF(P504=\"\",$X$505-SUM(OFFSET($X$483:X502,0,0,COUNTA($X$483:X502),1)),ROUND(V503*100/ORÇAMENTO.TotalOrçamento,2))","v":0}]
[null,null,null,null,null,null,null,null,null,null,null,null,null,null,"TOTAL GERAL DO ORÇAMENTO (R$)",null,null,null,{"$f":"SUM(S484:U503)","v":0},null,null,{"$f":"SUM(V484:W503)","v":0},null,{"$f":"SUM(X484:X503)","v":100}]
[null,null,null,null,null,null,null,null,null,null,null,null,null,null,null,null,null,null,{"$f":"$W$432","v":0},null,null,{"$f":"$W$434","v":0},null,100]
[null,null,null,null,null,null,null,null,null,null,null,null,null,null,null,null,null,null,"(TOTAL SEM BDI)",null,null,"(TOTAL COM BDI)",null,"(ARRED porcentagem)"]
[null,null,null,null,null,null,null,null,null,null,null,null,null,null,null,null,null,null,{"$f":"IF(AND(S504=S505,S504>0),\"OK\",\"ERRO\")","v":"ERRO"},null,null,{"$f":"IF(AND(V504=V505,V504>0),\"OK\",\"ERRO\")","v":"ERRO"},null,{"$f":"IF(AND(X504=100,S484<>0),\"OK\",\"ERRO\")","v":"ERRO"}]

{"sheet":"Resumo ","index":1,"n_rows":39,"n_cols":9,"rows_kept":39,"cut":false,"hidden":false,"merged":[[13,0,14,0],[34,2,34,3],[35,2,35,3],[31,2,31,3],[32,2,32,3],[33,2,33,3],[28,2,28,3],[29,2,29,3],[30,2,30,3],[0,1,0,8],[36,1,36,5],[2,1,2,5],[3,1,3,5],[5,1,5,5],[6,1,6,5],[8,1,8,5],[9,1,9,5],[11,3,11,5],[12,3,12,5],[10,1,10,8],[11,6,11,8],[12,6,12,8],[25,2,25,3],[21,2,21,3],[22,2,22,3],[6,6,6,8],[7,1,7,8],[8,6,8,8],[9,6,9,8],[13,1,13,8],[1,1,1,8],[2,6,2,8],[3,6,3,8],[4,1,4,8],[5,6,5,8],[42,3,42,7],[11,1,11,2],[12,1,12,2],[15,2,15,3],[16,2,16,3],[14,1,14,8],[17,2,17,3],[23,2,23,3],[18,2,18,3],[19,2,19,3],[20,2,20,3],[41,3,41,7],[24,2,24,3],[26,2,26,3],[27,2,27,3],[38,1,38,8]]}
[]
[]
[null,"UNIDADE ESCOLAR",null,null,null,null,"CÓDIGO INEP"]
[null,{"$f":"Orçamento!$O$4","v":"CENTRO DE ENSINO EM PERÍODO INTEGRAL PEDRO XAVIER TEIXEIRA"},null,null,null,null,{"$f":"Orçamento!V4","v":52033562}]
[]
[null,"OBRA",null,null,null,null,"CIDADE"]
[null,{"$f":"Orçamento!$O$7","v":"REFORMA"},null,null,null,null,{"$f":"Orçamento!$V$7","v":"GOIÂNIA"}]
[]
[null,"ENDEREÇO",null,null,null,null,"CRE"]
[null,{"$f":"Orçamento!$R$10","v":"RUA 1027 Nº 70 70, SETOR PEDRO LUDOVICO, CEP:74825-040"},null,null,null,null,{"$f":"Orçamento!$O$10","v":"GOIÂNIA"}]
[]
[null,"REFERÊNCIA",null,"DATA",null,null,"ÁREA TOTAL CONSTRUÍDA (M²)"]
[null,{"$f":"CONCATENATE(\"AGETOP E SINAPI - \",Orçamento!$W$10)","v":"AGETOP E SINAPI - ONERADA"},null,{"$f":"Orçamento!$S$7","v":"2020-03-25"},null,null,{"$f":"Orçamento!$S$13","v":4083.99}]
["FILTRO"]
[null,"RESUMO GERAL DO ORÇAMENTO"]
["↓","ITEM","DESCRIÇÃO DOS SERVIÇOS",null,"UNID","QUANT","PREÇO SEM BDI","PREÇO COM BDI","PARTICIP. (%)"]
[{"$f":"IF(E17>0,\"F\",\"\")","v":"F"},"1.",{"$f":"Orçamento!$P484","v":"REFORMA"},null,"UN ",1,{"$f":"IFERROR(Orçamento!S484,\"-\")","v":0},{"$f":"IFERROR(Orçamento!V484,\"\")","v":0},{"$f":"Orçamento!X484","v":100}]
[{"$f":"IF(E18>0,\"F\",\"\")","v":""},"2.",{"$f":"Orçamento!$P485","v":""},null,null,null,{"$f":"IFERROR(Orçamento!S485,\"-\")","v":0},{"$f":"IFERROR(Orçamento!V485,\"\")","v":0},{"$f":"Orçamento!X485","v":0}]
["","3.",{"$f":"Orçamento!$P486","v":""},null,null,null,{"$f":"IFERROR(Orçamento!S486,\"-\")","v":0},{"$f":"IFERROR(Orçamento!V486,\"\")","v":0},{"$f":"Orçamento!X486","v":0}]
["","4.",{"$f":"Orçamento!$P487","v":""},null,null,null,{"$f":"IFERROR(Orçamento!S487,\"-\")","v":0},{"$f":"IFERROR(Orçamento!V487,\"\")","v":0},{"$f":"Orçamento!X487","v":0}]
["","5.",{"$f":"Orçamento!$P488","v":""},null,null,null,{"$f":"IFERROR(Orçamento!S488,\"-\")","v":0},{"$f":"IFERROR(Orçamento!V488,\"\")","v":0},{"$f":"Orçamento!X488","v":0}]
["","6.",{"$f":"Orçamento!$P489","v":""},null,null,null,{"$f":"IFERROR(Orçamento!S489,\"-\")","v":0},{"$f":"IFERROR(Orçamento!V489,\"\")","v":0},{"$f":"Orçamento!X489","v":0}]
["","7.",{"$f":"Orçamento!$P490","v":""},null,null,null,{"$f":"IFERROR(Orçamento!S490,\"-\")","v":0},{"$f":"IFERROR(Orçamento!V490,\"\")","v":0},{"$f":"Orçamento!X490","v":0}]
["","8.",{"$f":"Orçamento!$P491","v":""},null,null,null,{"$f":"IFERROR(Orçamento!S491,\"-\")","v":0},{"$f":"IFERROR(Orçamento!V491,\"\")","v":0},{"$f":"Orçamento!X491","v":0}]
["","9.",{"$f":"Orçamento!$P492","v":""},null,null,null,{"$f":"IFERROR(Orçamento!S492,\"-\")","v":0},{"$f":"IFERROR(Orçamento!V492,\"\")","v":0},{"$f":"Orçamento!X492","v":0}]
["","10.",{"$f":"Orçamento!$P493","v":""},null,null,null,{"$f":"IFERROR(Orçamento!S493,\"-\")","v":0},{"$f":"IFERROR(Orçamento!V493,\"\")","v":0},{"$f":"Orçamento!X493","v":0}]
["","11.",{"$f":"Orçamento!$P494","v":""},null,null,null,{"$f":"IFERROR(Orçamento!S494,\"-\")","v":0},{"$f":"IFERROR(Orçamento!V494,\"\")","v":0},{"$f":"Orçamento!X494","v":0}]
["","12.",{"$f":"Orçamento!$P495","v":""},null,null,null,{"$f":"IFERROR(Orçamento!S495,\"-\")","v":0},{"$f":"IFERROR(Orçamento!V495,\"\")","v":0},{"$f":"Orçamento!X495","v":0}]
["","13.",{"$f":"Orçamento!$P496","v":""},null,null,null,{"$f":"IFERROR(Orçamento!S496,\"-\")","v":0},{"$f":"IFERROR(Orçamento!V496,\"\")","v":0},{"$f":"Orçamento!X496","v":0}]
["","14.",{"$f":"Orçamento!$P497","v":""},null,null,null,{"$f":"IFERROR(Orçamento!S497,\"-\")","v":0},{"$f":"IFERROR(Orçamento!V497,\"\")","v":0},{"$f":"Orçamento!X497","v":0}]
["","15.",{"$f":"Orçamento!$P498","v":""},null,null,null,{"$f":"IFERROR(Orçamento!S498,\"-\")","v":0},{"$f":"IFERROR(Orçamento!V498,\"\")","v":0},{"$f":"Orçamento!X498","v":0}]
["","16.",{"$f":"Orçamento!$P499","v":""},null,null,null,{"$f":"IFERROR(Orçamento!S499,\"-\")","v":0},{"$f":"IFERROR(Orçamento!V499,\"\")","v":0},{"$f":"Orçamento!X499","v":0}]
["","17.",{"$f":"Orçamento!$P500","v":""},null,null,null,{"$f":"IFERROR(Orçamento!S500,\"-\")","v":0},{"$f":"IFERROR(Orçamento!V500,\"\")","v":0},{"$f":"Orçamento!X500","v":0}]
["","18.",{"$f":"Orçamento!$P501","v":""},null,null,null,{"$f":"IFERROR(Orçamento!S501,\"-\")","v":0},{"$f":"IFERROR(Orçamento!V501,\"\")","v":0},{"$f":"Orçamento!X501","v":0}]
["","19.",{"$f":"Orçamento!$P502","v":""},null,null,null,{"$f":"IFERROR(Orçamento!S502,\"-\")","v":0},{"$f":"IFERROR(Orçamento!V502,\"\")","v":0},{"$f":"Orçamento!X502","v":0}]
["","20.",{"$f":"Orçamento!$P503","v":""},null,null,null,{"$f":"IFERROR(Orçamento!S503,\"-\")","v":0},{"$f":"IFERROR(Orçamento!V503,\"\")","v":0},{"$f":"Orçamento!X503","v":0}]
["F","TOTAL GERAL DO ORÇAMENTO (R$)",null,null,null,null,{"$f":"SUM(G17:G36)","v":0},{"$f":"SUM(H17:H36)","v":0},{"$f":"SUM(I17:I36)","v":100}]
["F"]
["F"]

{"sheet":"Somatório","index":2,"n_rows":45,"n_cols":6,"rows_kept":45,"cut":false,"hidden":false,"merged":[[13,0,14,0],[42,1,42,2],[44,1,44,5],[47,3,47,5],[48,3,48,5],[13,1,13,5],[9,1,9,3],[9,4,9,5],[11,1,11,2],[11,4,11,5],[12,1,12,2],[12,4,12,5],[0,1,0,5],[14,1,14,5],[2,1,2,3],[2,4,2,5],[3,1,3,3],[3,4,3,5],[5,1,5,3],[5,4,5,5],[6,1,6,3],[6,4,6,5],[8,1,8,3],[8,4,8,5],[1,1,1,5],[4,1,4,5],[7,1,7,5],[10,1,10,5]]}
[]
[]
[null,"UNIDADE ESCOLAR",null,null,"CÓDIGO INEP"]
[null,{"$f":"Orçamento!$O$4","v":"CENTRO DE ENSINO EM PERÍODO INTEGRAL PEDRO XAVIER TEIXEIRA"},null,null,{"$f":"Orçamento!V4","v":52033562}]
[]
[null,"OBRA",null,null,"CIDADE"]
[null,{"$f":"Orçamento!$O$7","v":"REFORMA"},null,null,{"$f":"Orçamento!$V$7","v":"GOIÂNIA"}]
[]
[null,"ENDEREÇO",null,null,"CRE"]
[null,{"$f":"Orçamento!$R$10","v":"RUA 1027 Nº 70 70, SETOR PEDRO LUDOVICO, CEP:74825-040"},null,null,{"$f":"Orçamento!$O$10","v":"GOIÂNIA"}]
[]
[null,"REFERÊNCIA",null,"DATA","ÁREA TOTAL CONSTRUÍDA (M²)"]
[null,{"$f":"CONCATENATE(\"AGETOP E SINAPI - \",Orçamento!$W$10)","v":"AGETOP E SINAPI - ONERADA"},null,{"$f":"Orçamento!$S$7","v":"2020-03-25"},{"$f":"Orçamento!$S$13","v":4083.99}]
["FILTRO"]
[null,"SOMATÓRIO DE SERVIÇOS"]
["↓","ITEM","DESCRIÇÃO DOS SERVIÇOS","PREÇO SEM BDI (R$)","PREÇO COM BDI (R$)","PARTIC.  ( % )"]
[{"$f":"IF(D17>0,\"F\",\"\")","v":""},"a.",{"$f":"Orçamento!P450","v":"SERVIÇOS PRELIMINARES"},{"$f":"Orçamento!S450","v":0},{"$f":"Orçamento!V450","v":0},{"$f":"Orçamento!X450","v":0}]
[{"$f":"IF(D18>0,\"F\",\"\")","v":""},"b.",{"$f":"Orçamento!P451","v":"TRANSPORTES"},{"$f":"Orçamento!S451","v":0},{"$f":"Orçamento!V451","v":0},{"$f":"Orçamento!X451","v":0}]
["","c.",{"$f":"Orçamento!P452","v":"SERVIÇO EM TERRA"},{"$f":"Orçamento!S452","v":0},{"$f":"Orçamento!V452","v":0},{"$f":"Orçamento!X452","v":0}]
["","d.",{"$f":"Orçamento!P453","v":"FUNDAÇÕES E SONDAGENS"},{"$f":"Orçamento!S453","v":0},{"$f":"Orçamento!V453","v":0},{"$f":"Orçamento!X453","v":0}]
["","e.",{"$f":"Orçamento!P454","v":"ESTRUTURA"},{"$f":"Orçamento!S454","v":0},{"$f":"Orçamento!V454","v":0},{"$f":"Orçamento!X454","v":0}]
["","f.",{"$f":"Orçamento!P455","v":"INSTALAÇÕES ELÉTRICAS"},{"$f":"Orçamento!S455","v":0},{"$f":"Orçamento!V455","v":0},{"$f":"Orçamento!X455","v":0}]
["","g.",{"$f":"Orçamento!P456","v":"INSTALAÇÕES HIDROSSANITÁRIAS"},{"$f":"Orçamento!S456","v":0},{"$f":"Orçamento!V456","v":0},{"$f":"Orçamento!X456","v":0}]
["","h.",{"$f":"Orçamento!P457","v":"INSTALAÇÕES ESPECIAIS"},{"$f":"Orçamento!S457","v":0},{"$f":"Orçamento!V457","v":0},{"$f":"Orçamento!X457","v":0}]
["","i.",{"$f":"Orçamento!P458","v":"ALVENARIAS E DIVISÓRIAS"},{"$f":"Orçamento!S458","v":0},{"$f":"Orçamento!V458","v":0},{"$f":"Orçamento!X458","v":0}]
["","j.",{"$f":"Orçamento!P459","v":"ALVENARIA AUTO-PORTANTE"},{"$f":"Orçamento!S459","v":0},{"$f":"Orçamento!V459","v":0},{"$f":"Orçamento!X459","v":0}]
["","k.",{"$f":"Orçamento!P460","v":"IMPERMEABILIZAÇÃO"},{"$f":"Orçamento!S460","v":0},{"$f":"Orçamento!V460","v":0},{"$f":"Orçamento!X460","v":0}]
["","l.",{"$f":"Orçamento!P461","v":"ISOLAMENTO TÉRMICO E ACÚSTICO"},{"$f":"Orçamento!S461","v":0},{"$f":"Orçamento!V461","v":0},{"$f":"Orçamento!X461","v":0}]
["","m.",{"$f":"Orçamento!P462","v":"ESTRUTURA DE MADEIRA"},{"$f":"Orçamento!S462","v":0},{"$f":"Orçamento!V462","v":0},{"$f":"Orçamento!X462","v":0}]
["","n.",{"$f":"Orçamento!P463","v":"ESTRUTURAS METÁLICAS"},{"$f":"Orçamento!S463","v":0},{"$f":"Orçamento!V463","v":0},{"$f":"Orçamento!X463","v":0}]
["","o.",{"$f":"Orçamento!P464","v":"COBERTURAS"},{"$f":"Orçamento!S464","v":0},{"$f":"Orçamento!V464","v":0},{"$f":"Orçamento!X464","v":0}]
["","p.",{"$f":"Orçamento!P465","v":"ESQUADRIAS DE MADEIRA"},{"$f":"Orçamento!S465","v":0},{"$f":"Orçamento!V465","v":0},{"$f":"Orçamento!X465","v":0}]
["","q.",{"$f":"Orçamento!P466","v":"ESQUADRIAS METÁLICAS"},{"$f":"Orçamento!S466","v":0},{"$f":"Orçamento!V466","v":0},{"$f":"Orçamento!X466","v":0}]
["","r.",{"$f":"Orçamento!P467","v":"VIDROS"},{"$f":"Orçamento!S467","v":0},{"$f":"Orçamento!V467","v":0},{"$f":"Orçamento!X467","v":0}]
["","s.",{"$f":"Orçamento!P468","v":"REVESTIMENTO DE PAREDE"},{"$f":"Orçamento!S468","v":0},{"$f":"Orçamento!V468","v":0},{"$f":"Orçamento!X468","v":0}]
["","t.",{"$f":"Orçamento!P469","v":"FORROS"},{"$f":"Orçamento!S469","v":0},{"$f":"Orçamento!V469","v":0},{"$f":"Orçamento!X469","v":0}]
["","u.",{"$f":"Orçamento!P470","v":"REVESTIMENTO DE PISO"},{"$f":"Orçamento!S470","v":0},{"$f":"Orçamento!V470","v":0},{"$f":"Orçamento!X470","v":0}]
["","v.",{"$f":"Orçamento!P471","v":"FERRAGENS"},{"$f":"Orçamento!S471","v":0},{"$f":"Orçamento!V471","v":0},{"$f":"Orçamento!X471","v":0}]
["","w.",{"$f":"Orçamento!P472","v":"MARCENARIA"},{"$f":"Orçamento!S472","v":0},{"$f":"Orçamento!V472","v":0},{"$f":"Orçamento!X472","v":0}]
["","x.",{"$f":"Orçamento!P473","v":"ADMINISTRAÇÃO"},{"$f":"Orçamento!S473","v":0},{"$f":"Orçamento!V473","v":0},{"$f":"Orçamento!X473","v":0}]
["","y.",{"$f":"Orçamento!P474","v":"PINTURA"},{"$f":"Orçamento!S474","v":0},{"$f":"Orçamento!V474","v":0},{"$f":"Orçamento!X474","v":0}]
["","z.",{"$f":"Orçamento!P475","v":"DIVERSOS"},{"$f":"Orçamento!S475","v":0},{"$f":"Orçamento!V475","v":0},{"$f":"Orçamento!X475","v":0}]
["F","TOTAL GERAL DO ORÇAMENTO",null,{"$f":"SUM(D17:D42)","v":0},{"$f":"SUM(E17:E42)","v":0},{"$f":"SUM(F17:F42)","v":0}]
[]
[null,"(*) Para itens da AGETOP, os vidros não estão inclusos nas esquadrias e já foram considerados os custos de contramarco para as esquadrias de alumínio;"]

{"sheet":"Cronog_120_Dias","index":3,"n_rows":99,"n_cols":23,"rows_kept":99,"cut":false,"hidden":false,"merged":[[92,17,92,20],[93,17,93,20],[94,17,94,20],[95,17,95,20],[77,17,77,20],[79,17,79,20],[80,17,80,20],[82,17,82,20],[83,17,83,20],[86,17,86,20],[88,17,88,20],[89,17,89,20],[91,17,91,20],[65,17,65,20],[67,17,67,20],[68,17,68,20],[70,17,70,20],[71,17,71,20],[73,17,73,20],[74,17,74,20],[76,17,76,20],[52,17,52,20],[53,17,53,20],[55,17,55,20],[56,17,56,20],[58,17,58,20],[59,17,59,20],[61,17,61,20],[62,17,62,20],[64,17,64,20],[38,17,38,20],[40,17,40,20],[41,17,41,20],[43,17,43,20],[44,17,44,20],[46,17,46,20],[47,17,47,20],[49,17,49,20],[50,17,50,20],[25,17,25,20],[26,17,26,20],[28,17,28,20],[29,17,29,20],[31,17,31,20],[32,17,32,20],[34,17,34,20],[35,17,35,20],[37,17,37,20],[12,17,12,20],[13,17,13,20],[14,17,14,20],[16,17,16,20],[17,17,17,20],[19,17,19,20],[20,17,20,20],[22,17,22,20],[23,17,23,20],[2,1,2,7],[5,1,5,7],[6,1,6,7],[8,1,8,7],[9,1,9,7],[4,1,4,21],[7,1,7,21],[0,1,0,21],[1,1,1,21],[2,8,2,21],[12,0,13,0],[9,0,11,0],[11,1,11,21],[92,1,92,2],[92,5,92,8],[92,13,92,16],[93,1,93,2],[93,5,93,8],[93,13,93,16],[74,13,74,16],[74,5,74,8],[68,13,68,16],[70,5,70,8],[70,13,70,16],[59,5,59,8],[71,1,73,2],[71,4,73,4],[71,5,71,8],[71,13,71,16],[73,5,73,8],[73,13,73,16],[59,13,59,16],[61,5,61,8],[61,13,61,16],[94,1,94,2],[94,5,94,8],[94,13,94,16],[76,5,76,8],[76,13,76,16],[77,5,77,8],[77,13,77,16],[79,5,79,8],[79,13,79,16],[80,5,80,8],[80,13,80,16],[82,5,82,8],[82,13,82,16],[77,3,79,3],[80,3,82,3],[86,1,88,2],[80,4,82,4],[86,9,86,12],[88,9,88,12],[89,9,89,12],[91,9,91,12],[92,9,92,12],[93,9,93,12],[94,9,94,12],[95,1,95,2],[95,5,95,8],[95,13,95,16],[97,1,97,4],[98,1,98,21],[86,13,86,16],[88,5,88,8],[88,13,88,16],[85,5,85,8],[89,1,91,2],[89,4,91,4],[89,5,89,8],[89,13,89,16],[91,5,91,8],[91,13,91,16],[89,3,91,3],[86,4,88,4],[86,5,86,8],[86,3,88,3],[83,1,85,2],[83,4,85,4],[83,5,83,8],[83,13,83,16],[95,9,95,12],[68,5,68,8],[65,5,65,8],[65,13,65,16],[67,5,67,8],[67,13,67,16],[65,3,67,3],[62,13,62,16],[64,5,64,8],[64,13,64,16],[62,5,62,8],[53,13,53,16],[55,5,55,8],[55,13,55,16],[50,5,50,8],[50,13,50,16],[52,5,52,8],[52,13,52,16],[56,13,56,16],[58,5,58,8],[58,13,58,16],[53,5,53,8],[56,5,56,8],[50,9,50,12],[52,9,52,12],[53,9,53,12],[55,9,55,12],[56,9,56,12],[58,9,58,12],[44,13,44,16],[46,5,46,8],[46,13,46,16],[47,1,49,2],[47,4,49,4],[47,5,47,8],[47,13,47,16],[49,5,49,8],[49,13,49,16],[44,5,44,8],[47,3,49,3],[44,9,44,12],[46,9,46,12],[47,9,47,12],[49,9,49,12],[35,13,35,16],[37,5,37,8],[37,13,37,16],[35,3,37,3],[40,13,40,16],[38,3,40,3],[38,13,38,16],[41,1,43,2],[41,4,43,4],[41,5,41,8],[41,13,41,16],[43,5,43,8],[43,13,43,16],[41,3,43,3],[35,5,35,8],[38,5,38,8],[40,5,40,8],[35,9,35,12],[37,9,37,12],[38,9,38,12],[40,9,40,12],[41,9,41,12],[43,9,43,12],[29,13,29,16],[31,5,31,8],[31,13,31,16],[32,1,34,2],[32,4,34,4],[32,5,32,8],[32,13,32,16],[34,5,34,8],[34,13,34,16],[32,3,34,3],[29,5,29,8],[29,1,31,2],[29,4,31,4],[29,9,29,12],[31,9,31,12],[32,9,32,12],[34,9,34,12],[26,1,28,2],[26,4,28,4],[26,5,26,8],[26,13,26,16],[28,5,28,8],[28,13,28,16],[23,3,25,3],[23,1,25,2],[23,4,25,4],[23,5,23,8],[26,3,28,3],[26,9,26,12],[28,9,28,12],[14,3,16,3],[17,3,19,3],[14,4,16,4],[14,5,14,8],[14,13,14,16],[16,5,16,8],[16,13,16,16],[23,13,23,16],[25,5,25,8],[25,13,25,16],[17,13,17,16],[19,5,19,8],[19,13,19,16],[25,9,25,12],[20,1,22,2],[20,4,22,4],[20,5,20,8],[20,13,20,16],[22,5,22,8],[22,13,22,16],[20,3,22,3],[83,3,85,3],[53,4,55,4],[59,1,61,2],[59,4,61,4],[74,1,76,2],[77,1,79,2],[77,4,79,4],[80,1,82,2],[65,1,67,2],[68,3,70,3],[62,3,64,3],[68,1,70,2],[56,3,58,3],[65,4,67,4],[71,3,73,3],[74,3,76,3],[74,4,76,4],[56,1,58,2],[68,4,70,4],[44,3,46,3],[62,1,64,2],[62,4,64,4],[38,1,40,2],[38,4,40,4],[59,3,61,3],[44,1,46,2],[44,4,46,4],[53,1,55,2],[50,1,52,2],[50,4,52,4],[10,1,10,21],[9,8,9,21],[8,8,8,21],[3,8,3,21],[6,8,6,21],[5,8,5,21],[3,1,3,7],[56,4,58,4],[29,3,31,3],[35,1,37,2],[35,4,37,4],[50,3,52,3],[53,3,55,3],[12,21,13,21],[13,1,13,2],[13,5,13,8],[13,13,13,16],[12,3,13,3],[12,13,12,16],[14,1,16,2],[12,5,12,8],[17,1,19,2],[17,4,19,4],[17,5,17,8],[12,9,12,12],[13,9,13,12],[14,9,14,12],[16,9,16,12],[17,9,17,12],[19,9,19,12],[20,9,20,12],[22,9,22,12],[23,9,23,12],[59,9,59,12],[61,9,61,12],[62,9,62,12],[64,9,64,12],[65,9,65,12],[67,9,67,12],[68,9,68,12],[70,9,70,12],[71,9,71,12],[73,9,73,12],[74,9,74,12],[76,9,76,12],[77,9,77,12],[79,9,79,12],[80,9,80,12],[82,9,82,12],[83,9,83,12],[85,9,85,12]]}
[]
[]
[null,"UNIDADE ESCOLAR",null,null,null,null,null,null,"PRAZO"]
[null,{"$f":"Orçamento!$O$4","v":"CENTRO DE ENSINO EM PERÍODO INTEGRAL PEDRO XAVIER TEIXEIRA"},null,null,null,null,null,null,"120 DIAS CORRIDOS"]
[]
[null,"OBRA",null,null,null,null,null,null,"DATA"]
[null,{"$f":"Orçamento!$O$7","v":"REFORMA"},null,null,null,null,null,null,{"$f":"Orçamento!$S$7","v":"2020-03-25"}]
[]
[null,"LOCAL",null,null,null,null,null,null,"ÁREA TOTAL CONSTRUÍDA (M²)"]
["FILTRO",{"$f":"Orçamento!$V$7","v":"GOIÂNIA"},null,null,null,null,null,null,{"$f":"Orçamento!$S$13","v":4083.99}]
[]
[null,"CRONOGRAMA - FÍSICO FINANCEIRO"]
["↓","CUSTO TOTAL:",{"$f":"D93","v":0},"VALOR","Dias:",30,null,null,null,60,null,null,null,90,null,null,null,120,null,null,null,"TOTAL"]
[null,"DESCRIÇÃO DOS SERVIÇOS",null,null,"%","1ª PARCELA",null,null,null,"2ª PARCELA",null,null,null,"3ª PARCELA",null,null,null,"4ª PARCELA"]
[{"$f":"IF(D15>0,\"F\",\"\")","v":""},"SERVIÇOS PRELIMINARES",null,{"$f":"Orçamento!V450","v":0},{"$f":"Orçamento!X450","v":0},{"$f":"ROUND(F17*$D$15,2)","v":0},null,null,null,{"$f":"ROUND(J17*$D$15,2)","v":0},null,null,null,{"$f":"ROUND(N17*$D$15,2)","v":0},null,null,null,{"$f":"ROUND(R17*$D$15,2)","v":0},null,null,null,{"$f":"SUM(F15:U15)","v":0},{"$f":"IF(V15=D15,\"OK\",\"ERRO\")","v":"OK"}]
[{"$f":"IF(A15=\"F\",A15,\"\")","v":""}]
[{"$f":"IF(A16=\"F\",A16,\"\")","v":""},null,null,null,null,0.27,null,null,null,{"$f":"F17","v":0.27},null,null,null,{"$f":"J17","v":0.27},null,null,null,{"$f":"1-SUM(F17:Q17)","v":0.18999999999999995},null,null,null,{"$f":"IFERROR(E15/100,\"\")","v":0},{"$f":"IF(SUM(F17:U17)=100%,\"OK\",\"ERRO\")","v":"OK"}]
[{"$f":"IF(D18>0,\"F\",\"\")","v":""},"TRANSPORTES",null,{"$f":"Orçamento!V451","v":0},{"$f":"Orçamento!X451","v":0},{"$f":"ROUND(F20*$D$18,2)","v":0},null,null,null,{"$f":"ROUND(J20*$D$18,2)","v":0},null,null,null,{"$f":"ROUND(N20*$D$18,2)","v":0},null,null,null,{"$f":"ROUND(R20*$D$18,2)","v":0},null,null,null,{"$f":"SUM(F18:U18)","v":0},{"$f":"IF(V18=D18,\"OK\",\"ERRO\")","v":"OK"}]
[{"$f":"IF(A18=\"F\",A18,\"\")","v":""}]
[{"$f":"IF(A19=\"F\",A19,\"\")","v":""},null,null,null,null,0.26,null,null,null,{"$f":"F20","v":0.26},null,null,null,{"$f":"J20","v":0.26},null,null,null,{"$f":"1-SUM(F20:Q20)","v":0.21999999999999997},null,null,null,{"$f":"IFERROR(E18/100,\"\")","v":0},{"$f":"IF(SUM(F20:U20)=100%,\"OK\",\"ERRO\")","v":"OK"}]
[{"$f":"IF(D21>0,\"F\",\"\")","v":""},"SERVIÇO EM TERRA",null,{"$f":"Orçamento!V452","v":0},{"$f":"Orçamento!X452","v":0},{"$f":"ROUND(F23*$D$21,2)","v":0},null,null,null,{"$f":"ROUND(J23*$D$21,2)","v":0},null,null,null,{"$f":"ROUND(N23*$D$21,2)","v":0},null,null,null,{"$f":"ROUND(R23*$D$21,2)","v":0},null,null,null,{"$f":"SUM(F21:U21)","v":0},{"$f":"IF(V21=D21,\"OK\",\"ERRO\")","v":"OK"}]
[{"$f":"IF(A21=\"F\",A21,\"\")","v":""}]
[{"$f":"IF(A22=\"F\",A22,\"\")","v":""},null,null,null,null,0.28999999999999998,null,null,null,0.3,null,null,null,{"$f":"1-SUM(F23:M23)","v":0.41000000000000003},null,null,null,0,null,null,null,{"$f":"IFERROR(E21/100,\"\")","v":0},{"$f":"IF(SUM(F23:U23)=100%,\"OK\",\"ERRO\")","v":"OK"}]
[{"$f":"IF(D24>0,\"F\",\"\")","v":""},"FUNDAÇÕES E SONDAGENS",null,{"$f":"Orçamento!V453","v":0},{"$f":"Orçamento!X453","v":0},{"$f":"ROUND(F26*$D$24,2)","v":0},null,null,null,{"$f":"ROUND(J26*$D$24,2)","v":0},null,null,null,{"$f":"ROUND(N26*$D$24,2)","v":0},null,null,null,{"$f":"ROUND(R26*$D$24,2)","v":0},null,null,null,{"$f":"SUM(F24:U24)","v":0},{"$f":"IF(V24=D24,\"OK\",\"ERRO\")","v":"OK"}]
[{"$f":"IF(A24=\"F\",A24,\"\")","v":""}]
[{"$f":"IF(A25=\"F\",A25,\"\")","v":""},null,null,null,null,0.35,null,null,null,{"$f":"F26","v":0.35},null,null,null,{"$f":"1-SUM(F26:M26)","v":0.30000000000000004},null,null,null,null,null,null,null,{"$f":"IFERROR(E24/100,\"\")","v":0},{"$f":"IF(SUM(F26:U26)=100%,\"OK\",\"ERRO\")","v":"OK"}]
[{"$f":"IF(D27>0,\"F\",\"\")","v":""},"ESTRUTURA",null,{"$f":"Orçamento!V454","v":0},{"$f":"Orçamento!X454","v":0},{"$f":"ROUND(F29*$D$27,2)","v":0},null,null,null,{"$f":"ROUND(J29*$D$27,2)","v":0},null,null,null,{"$f":"ROUND(N29*$D$27,2)","v":0},null,null,null,{"$f":"ROUND(R29*$D$27,2)","v":0},null,null,null,{"$f":"SUM(F27:U27)","v":0},{"$f":"IF(V27=D27,\"OK\",\"ERRO\")","v":"OK"}]
[{"$f":"IF(A27=\"F\",A27,\"\")","v":""}]
[{"$f":"IF(A28=\"F\",A28,\"\")","v":""},null,null,null,null,0.35,null,null,null,0.35,null,null,null,0.1,null,null,null,{"$f":"1-SUM(F29:Q29)","v":0.20000000000000007},null,null,null,{"$f":"IFERROR(E27/100,\"\")","v":0},{"$f":"IF(SUM(F29:U29)=100%,\"OK\",\"ERRO\")","v":"OK"}]
[{"$f":"IF(D30>0,\"F\",\"\")","v":""},"INST.ELET/TELEFÔNICA/CABEAMENTO ESTRUTURADO",null,{"$f":"Orçamento!V455","v":0},{"$f":"Orçamento!X455","v":0},{"$f":"ROUND(F32*$D$30,2)","v":0},null,null,null,{"$f":"ROUND(J32*$D$30,2)","v":0},null,null,null,{"$f":"ROUND(N32*$D$30,2)","v":0},null,null,null,{"$f":"ROUND(R32*$D$30,2)","v":0},null,null,null,{"$f":"SUM(F30:U30)","v":0},{"$f":"IF(V30=D30,\"OK\",\"ERRO\")","v":"OK"}]
[{"$f":"IF(A30=\"F\",A30,\"\")","v":""}]
[{"$f":"IF(A31=\"F\",A31,\"\")","v":""},null,null,null,null,0.22,null,null,null,{"$f":"F32+0.15","v":0.37},null,null,null,{"$f":"J32-0.05","v":0.32},null,null,null,{"$f":"1-SUM(F32:Q32)","v":9.000000000000008E-2},null,null,null,{"$f":"IFERROR(E30/100,\"\")","v":0},{"$f":"IF(SUM(F32:U32)=100%,\"OK\",\"ERRO\")","v":"OK"}]
[{"$f":"IF(D33>0,\"F\",\"\")","v":""},"INSTALAÇÕES HIDROSSANITÁRIAS",null,{"$f":"Orçamento!V456","v":0},{"$f":"Orçamento!X456","v":0},{"$f":"ROUND(F35*$D$33,2)","v":0},null,null,null,{"$f":"ROUND(J35*$D$33,2)","v":0},null,null,null,{"$f":"ROUND(N35*$D$33,2)","v":0},null,null,null,{"$f":"ROUND(R35*$D$33,2)","v":0},null,null,null,{"$f":"SUM(F33:U33)","v":0},{"$f":"IF(V33=D33,\"OK\",\"ERRO\")","v":"OK"}]
[{"$f":"IF(A33=\"F\",A33,\"\")","v":""}]
[{"$f":"IF(A34=\"F\",A34,\"\")","v":""},null,null,null,null,0.26,null,null,null,{"$f":"F35","v":0.26},null,null,null,{"$f":"J35","v":0.26},null,null,null,{"$f":"1-SUM(F35:Q35)","v":0.21999999999999997},null,null,null,{"$f":"IFERROR(E33/100,\"\")","v":0},{"$f":"IF(SUM(F35:U35)=100%,\"OK\",\"ERRO\")","v":"OK"}]
[{"$f":"IF(D36>0,\"F\",\"\")","v":""},"INSTALAÇÕES ESPECIAIS",null,{"$f":"Orçamento!V457","v":0},{"$f":"Orçamento!X457","v":0},{"$f":"ROUND(F38*$D$36,2)","v":0},null,null,null,{"$f":"ROUND(J38*$D$36,2)","v":0},null,null,null,{"$f":"ROUND(N38*$D$36,2)","v":0},null,null,null,{"$f":"ROUND(R38*$D$36,2)","v":0},null,null,null,{"$f":"SUM(F36:U36)","v":0},{"$f":"IF(V36=D36,\"OK\",\"ERRO\")","v":"OK"}]
[{"$f":"IF(A36=\"F\",A36,\"\")","v":""}]
[{"$f":"IF(A37=\"F\",A37,\"\")","v":""},null,null,null,null,0,null,null,null,1,null,null,null,0,null,null,null,0,null,null,null,{"$f":"IFERROR(E36/100,\"\")","v":0},{"$f":"IF(SUM(F38:U38)=100%,\"OK\",\"ERRO\")","v":"OK"}]
[{"$f":"IF(D39>0,\"F\",\"\")","v":""},"ALVENARIA E DIVISÓRIAS",null,{"$f":"Orçamento!V458","v":0},{"$f":"Orçamento!X458","v":0},{"$f":"ROUND(F41*$D$39,2)","v":0},null,null,null,{"$f":"ROUND(J41*$D$39,2)","v":0},null,null,null,{"$f":"ROUND(N41*$D$39,2)","v":0},null,null,null,{"$f":"ROUND(R41*$D$39,2)","v":0},null,null,null,{"$f":"SUM(F39:U39)","v":0},{"$f":"IF(V39=D39,\"OK\",\"ERRO\")","v":"OK"}]
[{"$f":"IF(A39=\"F\",A39,\"\")","v":""}]
[{"$f":"IF(A40=\"F\",A40,\"\")","v":""},null,null,null,null,0.24,null,null,null,{"$f":"F41","v":0.24},null,null,null,0.24,null,null,null,{"$f":"1-SUM(F41:Q41)","v":0.28000000000000003},null,null,null,{"$f":"IFERROR(E39/100,\"\")","v":0},{"$f":"IF(SUM(F41:U41)=100%,\"OK\",\"ERRO\")","v":"OK"}]
[{"$f":"IF(D42>0,\"F\",\"\")","v":""},"ALVENARIA AUTO-PORTANTE",null,{"$f":"Orçamento!V459","v":0},{"$f":"Orçamento!X459","v":0},0,null,null,null,0,null,null,null,0,null,null,null,0,null,null,null,{"$f":"SUM(F42:M42)","v":0}]
[{"$f":"IF(A42=\"F\",A42,\"\")","v":""}]
[{"$f":"IF(A43=\"F\",A43,\"\")","v":""},null,null,null,null,1,null,null,null,{"$f":"1-F44","v":0},null,null,null,1,null,null,null,1,null,null,null,{"$f":"IFERROR(E42/100,\"\")","v":0}]
[{"$f":"IF(D45>0,\"F\",\"\")","v":""},"IMPERMEABILIZAÇÃO",null,{"$f":"Orçamento!V460","v":0},{"$f":"Orçamento!X460","v":0},{"$f":"ROUND(F47*$D$45,2)","v":0},null,null,null,{"$f":"ROUND(J47*$D$45,2)","v":0},null,null,null,{"$f":"ROUND(N47*$D$45,2)","v":0},null,null,null,{"$f":"ROUND(R47*$D$45,2)","v":0},null,null,null,{"$f":"SUM(F45:U45)","v":0},{"$f":"IF(V45=D45,\"OK\",\"ERRO\")","v":"OK"}]
[{"$f":"IF(A45=\"F\",A45,\"\")","v":""}]
[{"$f":"IF(A46=\"F\",A46,\"\")","v":""},null,null,null,null,0.251,null,null,null,{"$f":"F47","v":0.251},null,null,null,{"$f":"1-SUM(F47:M47)","v":0.498},null,null,null,0,null,null,null,{"$f":"IFERROR(E45/100,\"\")","v":0},{"$f":"IF(SUM(F47:U47)=100%,\"OK\",\"ERRO\")","v":"OK"}]
[{"$f":"IF(D48>0,\"F\",\"\")","v":""},"ISOLAMENTO TÉRMICO E ACÚSTICO",null,{"$f":"Orçamento!V461","v":0},{"$f":"Orçamento!X461","v":0},{"$f":"ROUND(F50*$D$48,2)","v":0},null,null,null,{"$f":"ROUND(J50*$D$48,2)","v":0},null,null,null,{"$f":"ROUND(N50*$D$48,2)","v":0},null,null,null,{"$f":"ROUND(R50*$D$48,2)","v":0},null,null,null,{"$f":"SUM(F48:M48)","v":0}]
[{"$f":"IF(A48=\"F\",A48,\"\")","v":""}]
[{"$f":"IF(A49=\"F\",A49,\"\")","v":""},null,null,null,null,0.5,null,null,null,{"$f":"1-F50","v":0.5},null,null,null,0.35,null,null,null,0.35,null,null,null,{"$f":"IFERROR(E48/100,\"\")","v":0}]
[{"$f":"IF(D51>0,\"F\",\"\")","v":""},"ESTRUTURA DE MADEIRA",null,{"$f":"Orçamento!V462","v":0},{"$f":"Orçamento!X462","v":0},{"$f":"ROUND(F53*$D$51,2)","v":0},null,null,null,{"$f":"ROUND(J53*$D$51,2)","v":0},null,null,null,{"$f":"ROUND(N53*$D$51,2)","v":0},null,null,null,{"$f":"ROUND(R53*$D$51,2)","v":0},null,null,null,{"$f":"SUM(F51:U51)","v":0},{"$f":"IF(V51=D51,\"OK\",\"ERRO\")","v":"OK"}]
[{"$f":"IF(A51=\"F\",A51,\"\")","v":""}]
[{"$f":"IF(A52=\"F\",A52,\"\")","v":""},null,null,null,null,0.24,null,null,null,{"$f":"F53","v":0.24},null,null,null,{"$f":"1-SUM(F53:M53)","v":0.52},null,null,null,0,null,null,null,{"$f":"IFERROR(E51/100,\"\")","v":0},{"$f":"IF(SUM(F53:U53)=100%,\"OK\",\"ERRO\")","v":"OK"}]
[{"$f":"IF(D54>0,\"F\",\"\")","v":""},"ESTRUTURA METÁLICA",null,{"$f":"Orçamento!V463","v":0},{"$f":"Orçamento!X463","v":0},{"$f":"ROUND(F56*$D$54,2)","v":0},null,null,null,{"$f":"ROUND(J56*$D$54,2)","v":0},null,null,null,{"$f":"ROUND(N56*$D$54,2)","v":0},null,null,null,{"$f":"ROUND(R56*$D$54,2)","v":0},null,null,null,{"$f":"SUM(F54:U54)","v":0},{"$f":"IF(V54=D54,\"OK\",\"ERRO\")","v":"OK"}]
[{"$f":"IF(A54=\"F\",A54,\"\")","v":""}]
[{"$f":"IF(A55=\"F\",A55,\"\")","v":""},null,null,null,null,0.35199999999999998,null,null,null,{"$f":"F56","v":0.35199999999999998},null,null,null,{"$f":"1-SUM(F56:M56)","v":0.29600000000000004},null,null,null,0,null,null,null,{"$f":"IFERROR(E54/100,\"\")","v":0},{"$f":"IF(SUM(F56:U56)=100%,\"OK\",\"ERRO\")","v":"OK"}]
[{"$f":"IF(D57>0,\"F\",\"\")","v":""},"COBERTURAS",null,{"$f":"Orçamento!V464","v":0},{"$f":"Orçamento!X464","v":0},{"$f":"ROUND(F59*$D$57,2)","v":0},null,null,null,{"$f":"ROUND(J59*$D$57,2)","v":0},null,null,null,{"$f":"ROUND(N59*$D$57,2)","v":0},null,null,null,{"$f":"ROUND(R59*$D$57,2)","v":0},null,null,null,{"$f":"SUM(F57:U57)","v":0},{"$f":"IF(V57=D57,\"OK\",\"ERRO\")","v":"OK"}]
[{"$f":"IF(A57=\"F\",A57,\"\")","v":""}]
[{"$f":"IF(A58=\"F\",A58,\"\")","v":""},null,null,null,null,0,null,null,null,0.49,null,null,null,{"$f":"1-J59","v":0.51},null,null,null,0,null,null,null,{"$f":"IFERROR(E57/100,\"\")","v":0},{"$f":"IF(SUM(F59:U59)=100%,\"OK\",\"ERRO\")","v":"OK"}]
[{"$f":"IF(D60>0,\"F\",\"\")","v":""},"ESQUADRIAS DE MADEIRA",null,{"$f":"Orçamento!V465","v":0},{"$f":"Orçamento!X465","v":0},{"$f":"ROUND(F62*$D$60,2)","v":0},null,null,null,{"$f":"ROUND(J62*$D$60,2)","v":0},null,null,null,{"$f":"ROUND(N62*$D$60,2)","v":0},null,null,null,{"$f":"ROUND(R62*$D$60,2)","v":0},null,null,null,{"$f":"SUM(F60:M60)","v":0}]
[{"$f":"IF(A60=\"F\",A60,\"\")","v":""}]
[{"$f":"IF(A61=\"F\",A61,\"\")","v":""},null,null,null,null,0.54,null,null,null,{"$f":"1-F62","v":0.45999999999999996},null,null,null,0.32,null,null,null,0.32,null,null,null,{"$f":"IFERROR(E60/100,\"\")","v":0}]
[{"$f":"IF(D63>0,\"F\",\"\")","v":""},"ESQUADRIAS METÁLICAS",null,{"$f":"Orçamento!V466","v":0},{"$f":"Orçamento!X466","v":0},{"$f":"ROUND(F65*$D$63,2)","v":0},null,null,null,{"$f":"ROUND(J65*$D$63,2)","v":0},null,null,null,{"$f":"ROUND(N65*$D$63,2)","v":0},null,null,null,{"$f":"ROUND(R65*$D$63,2)","v":0},null,null,null,{"$f":"SUM(F63:U63)","v":0},{"$f":"IF(V63=D63,\"OK\",\"ERRO\")","v":"OK"}]
[{"$f":"IF(A63=\"F\",A63,\"\")","v":""}]
[{"$f":"IF(A64=\"F\",A64,\"\")","v":""},null,null,null,null,0,null,null,null,0.35,null,null,null,{"$f":"J65-0.05","v":0.3},null,null,null,{"$f":"1-SUM(F65:Q65)","v":0.35000000000000009},null,null,null,{"$f":"IFERROR(E63/100,\"\")","v":0},{"$f":"IF(SUM(F65:U65)=100%,\"OK\",\"ERRO\")","v":"OK"}]
[{"$f":"IF(D66>0,\"F\",\"\")","v":""},"VIDROS",null,{"$f":"Orçamento!V467","v":0},{"$f":"Orçamento!X467","v":0},{"$f":"ROUND(F68*$D$66,2)","v":0},null,null,null,{"$f":"ROUND(J68*$D$66,2)","v":0},null,null,null,{"$f":"ROUND(N68*$D$66,2)","v":0},null,null,null,{"$f":"ROUND(R68*$D$66,2)","v":0},null,null,null,{"$f":"SUM(F66:U66)","v":0},{"$f":"IF(V66=D66,\"OK\",\"ERRO\")","v":"OK"}]
[{"$f":"IF(A66=\"F\",A66,\"\")","v":""}]
[{"$f":"IF(A67=\"F\",A67,\"\")","v":""},null,null,null,null,0,null,null,null,0,null,null,null,0,null,null,null,1,null,null,null,{"$f":"IFERROR(E66/100,\"\")","v":0},{"$f":"IF(SUM(F68:U68)=100%,\"OK\",\"ERRO\")","v":"OK"}]
[{"$f":"IF(D69>0,\"F\",\"\")","v":""},"REVESTIMENTO DE PAREDE",null,{"$f":"Orçamento!V468","v":0},{"$f":"Orçamento!X468","v":0},{"$f":"ROUND(F71*$D$69,2)","v":0},null,null,null,{"$f":"ROUND(J71*$D$69,2)","v":0},null,null,null,{"$f":"ROUND(N71*$D$69,2)","v":0},null,null,null,{"$f":"ROUND(R71*$D$69,2)","v":0},null,null,null,{"$f":"SUM(F69:U69)","v":0},{"$f":"IF(V69=D69,\"OK\",\"ERRO\")","v":"OK"}]
[{"$f":"IF(A69=\"F\",A69,\"\")","v":""}]
[{"$f":"IF(A70=\"F\",A70,\"\")","v":""},null,null,null,null,0.18099999999999999,null,null,null,{"$f":"F71+0.05","v":0.23099999999999998},null,null,null,{"$f":"J71+0.05","v":0.28099999999999997},null,null,null,{"$f":"1-SUM(F71:Q71)","v":0.30700000000000005},null,null,null,{"$f":"IFERROR(E69/100,\"\")","v":0},{"$f":"IF(SUM(F71:U71)=100%,\"OK\",\"ERRO\")","v":"OK"}]
[{"$f":"IF(D72>0,\"F\",\"\")","v":""},"FORROS",null,{"$f":"Orçamento!V469","v":0},{"$f":"Orçamento!X469","v":0},{"$f":"ROUND(F74*$D$72,2)","v":0},null,null,null,{"$f":"ROUND(J74*$D$72,2)","v":0},null,null,null,{"$f":"ROUND(N74*$D$72,2)","v":0},null,null,null,{"$f":"ROUND(R74*$D$72,2)","v":0},null,null,null,{"$f":"SUM(F72:U72)","v":0},{"$f":"IF(V72=D72,\"OK\",\"ERRO\")","v":"OK"}]
[{"$f":"IF(A72=\"F\",A72,\"\")","v":""}]
[{"$f":"IF(A73=\"F\",A73,\"\")","v":""},null,null,null,null,0.22,null,null,null,{"$f":"F74+0.15","v":0.37},null,null,null,{"$f":"J74-0.05","v":0.32},null,null,null,{"$f":"1-SUM(F74:Q74)","v":9.000000000000008E-2},null,null,null,{"$f":"IFERROR(E72/100,\"\")","v":0},{"$f":"IF(SUM(F74:U74)=100%,\"OK\",\"ERRO\")","v":"OK"}]
[{"$f":"IF(D75>0,\"F\",\"\")","v":""},"REVESTIMENTO DE PISO",null,{"$f":"Orçamento!V470","v":0},{"$f":"Orçamento!X470","v":0},{"$f":"ROUND(F77*$D$75,2)","v":0},null,null,null,{"$f":"ROUND(J77*$D$75,2)","v":0},null,null,null,{"$f":"ROUND(N77*$D$75,2)","v":0},null,null,null,{"$f":"ROUND(R77*$D$75,2)","v":0},null,null,null,{"$f":"SUM(F75:U75)","v":0},{"$f":"IF(V75=D75,\"OK\",\"ERRO\")","v":"OK"}]
[{"$f":"IF(A75=\"F\",A75,\"\")","v":""}]
[{"$f":"IF(A76=\"F\",A76,\"\")","v":""},null,null,null,null,0.23100000000000001,null,null,null,{"$f":"F77","v":0.23100000000000001},null,null,null,{"$f":"J77-0.1","v":0.13100000000000001},null,null,null,{"$f":"1-SUM(F77:Q77)","v":0.40700000000000003},null,null,null,{"$f":"IFERROR(E75/100,\"\")","v":0},{"$f":"IF(SUM(F77:U77)=100%,\"OK\",\"ERRO\")","v":"OK"}]
[{"$f":"IF(D78>0,\"F\",\"\")","v":""},"FERRAGENS",null,{"$f":"Orçamento!V471","v":0},{"$f":"Orçamento!X471","v":0},{"$f":"ROUND(F80*$D$78,2)","v":0},null,null,null,{"$f":"ROUND(J80*$D$78,2)","v":0},null,null,null,{"$f":"ROUND(N80*$D$78,2)","v":0},null,null,null,{"$f":"ROUND(R80*$D$78,2)","v":0},null,null,null,{"$f":"SUM(F78:U78)","v":0},{"$f":"IF(V78=D78,\"OK\",\"ERRO\")","v":"OK"}]
[{"$f":"IF(A78=\"F\",A78,\"\")","v":""}]
[{"$f":"IF(A79=\"F\",A79,\"\")","v":""},null,null,null,null,0,null,null,null,0,null,null,null,0,null,null,null,1,null,null,null,{"$f":"IFERROR(E78/100,\"\")","v":0},{"$f":"IF(SUM(F80:U80)=100%,\"OK\",\"ERRO\")","v":"OK"}]
[{"$f":"IF(D81>0,\"F\",\"\")","v":""},"MARCENARIA",null,{"$f":"Orçamento!V472","v":0},{"$f":"Orçamento!X472","v":0},{"$f":"ROUND(F83*$D$81,2)","v":0},null,null,null,{"$f":"ROUND(J83*$D$81,2)","v":0},null,null,null,{"$f":"ROUND(N83*$D$81,2)","v":0},null,null,null,{"$f":"ROUND(R83*$D$81,2)","v":0},null,null,null,{"$f":"SUM(F81:M81)","v":0}]
[{"$f":"IF(A81=\"F\",A81,\"\")","v":""}]
[{"$f":"IF(A82=\"F\",A82,\"\")","v":""},null,null,null,null,0.4,null,null,null,{"$f":"1-F83","v":0.6},null,null,null,{"$f":"1-J83","v":0.4},null,null,null,{"$f":"1-N83","v":0.6},null,null,null,{"$f":"IFERROR(E81/100,\"\")","v":0}]
[{"$f":"IF(D84>0,\"F\",\"\")","v":""},"ADMINISTRAÇÃO - MENSALISTAS",null,{"$f":"Orçamento!V473","v":0},{"$f":"Orçamento!X473","v":0},{"$f":"ROUND(F86*$D$84,2)","v":0},null,null,null,{"$f":"ROUND(J86*$D$84,2)","v":0},null,null,null,{"$f":"ROUND(N86*$D$84,2)","v":0},null,null,null,{"$f":"ROUND(R86*$D$84,2)","v":0},null,null,null,{"$f":"SUM(F84:U84)","v":0},{"$f":"IF(V84=D84,\"OK\",\"ERRO\")","v":"OK"}]
[{"$f":"IF(A84=\"F\",A84,\"\")","v":""}]
[{"$f":"IF(A85=\"F\",A85,\"\")","v":""},null,null,null,null,0.49,null,null,null,{"$f":"1-F86","v":0.51},null,null,null,null,null,null,null,null,null,null,null,{"$f":"IFERROR(E84/100,\"\")","v":0},{"$f":"IF(SUM(F86:U86)=100%,\"OK\",\"ERRO\")","v":"OK"}]
[{"$f":"IF(D87>0,\"F\",\"\")","v":""},"PINTURA",null,{"$f":"Orçamento!V474","v":0},{"$f":"Orçamento!X474","v":0},{"$f":"ROUND(F89*$D$87,2)","v":0},null,null,null,{"$f":"ROUND(J89*$D$87,2)","v":0},null,null,null,{"$f":"ROUND(N89*$D$87,2)","v":0},null,null,null,{"$f":"ROUND(R89*$D$87,2)","v":0},null,null,null,{"$f":"SUM(F87:U87)","v":0},{"$f":"IF(V87=D87,\"OK\",\"ERRO\")","v":"OK"}]
[{"$f":"IF(A87=\"F\",A87,\"\")","v":""}]
[{"$f":"IF(A88=\"F\",A88,\"\")","v":""},null,null,null,null,0,null,null,null,0,null,null,null,0.4,null,null,null,0.6,null,null,null,{"$f":"IFERROR(E87/100,\"\")","v":0},{"$f":"IF(SUM(F89:U89)=100%,\"OK\",\"ERRO\")","v":"OK"}]
[{"$f":"IF(D90>0,\"F\",\"\")","v":""},"DIVERSOS",null,{"$f":"Orçamento!V475","v":0},{"$f":"Orçamento!X475","v":0},{"$f":"ROUND(F92*$D$90,2)","v":0},null,null,null,{"$f":"ROUND(J92*$D$90,2)","v":0},null,null,null,{"$f":"ROUND(N92*$D$90,2)","v":0},null,null,null,{"$f":"ROUND(R92*$D$90,2)","v":0},null,null,null,{"$f":"SUM(F90:U90)","v":0},{"$f":"IF(V90=D90,\"OK\",\"ERRO\")","v":"OK"}]
[{"$f":"IF(A90=\"F\",A90,\"\")","v":""}]
[{"$f":"IF(A91=\"F\",A91,\"\")","v":""},null,null,null,null,0.26129999999994091,null,null,null,{"$f":"F92+0.03","v":0.29129999999994094},null,null,null,{"$f":"J92","v":0.29129999999994094},null,null,null,{"$f":"1-SUM(F91:Q92)","v":0.15610000000017721},null,null,null,{"$f":"IFERROR(E90/100,\"\")","v":0},{"$f":"IF(SUM(F92:U92)=100%,\"OK\",\"ERRO\")","v":"OK"}]
["F","CUSTO DO ORÇAMENTO",null,{"$f":"SUM(D15:D92)","v":0},{"$f":"SUM(E15:E92)","v":0},{"$f":"F15+F18+F21+F24+F27+F30+F33+F36+F39+F42+F45+F48+F51+F54+F57+F60+F63+F66+F69+F72+F75+F78+F81+F84+F87+F90","v":0},null,null,null,{"$f":"J15+J18+J21+J24+J27+J30+J33+J36+J39+J42+J45+J48+J51+J54+J57+J60+J63+J66+J69+J72+J75+J78+J81+J84+J87+J90","v":0},null,null,null,{"$f":"N15+N18+N21+N24+N27+N30+N33+N36+N39+N42+N45+N48+N51+N54+N57+N60+N63+N66+N69+N72+N75+N78+N81+N84+N87+N90","v":0},null,null,null,{"$f":"R15+R18+R21+R24+R27+R30+R33+R36+R39+R42+R45+R48+R51+R54+R57+R60+R63+R66+R69+R72+R75+R78+R81+R84+R87+R90","v":0},null,null,null,{"$f":"V15+V18+V21+V24+V27+V30+V33+V36+V39+V42+V45+V48+V51+V54+V57+V60+V63+V66+V69+V72+V75+V78+V81+V84+V87+V90","v":0}]
["F","PERCENTUAIS:",null,null,null,{"$f":"IFERROR(F93/$D$93,\"\")","v":""},null,null,null,{"$f":"IFERROR(J93/$D$93,\"\")","v":""},null,null,null,{"$f":"IFERROR(N93/$D$93,\"\")","v":""},null,null,null,{"$f":"IFERROR(R93/$D$93,\"\")","v":""},null,null,null,{"$f":"SUM(F94:U94)","v":0}]
["F","TOTAIS ACUMULADOS:",null,null,null,{"$f":"F93","v":0},null,null,null,{"$f":"J93+F95","v":0},null,null,null,{"$f":"N93+J95","v":0},null,null,null,{"$f":"R93+N95","v":0}]
["F","PERCENTUAIS  ACUMULADOS:",null,null,null,{"$f":"F94","v":""},null,null,null,{"$f":"F96+J94","v":{"$error":"#VALUE!"}},null,null,null,{"$f":"J96+N94","v":{"$error":"#VALUE!"}},null,null,null,{"$f":"N96+R94","v":{"$error":"#VALUE!"}}]
["F"]
["F","OBSERVAÇÕES:"]
["F","Os pagamentos somente poderão ser efetuados mediante medição e atesto pelos técnicos da Secretaria da Educação. "]

{"sheet":"Composição BDI","index":4,"n_rows":45,"n_cols":9,"rows_kept":45,"cut":false,"hidden":false,"merged":[[11,0,11,3],[12,0,12,3],[14,0,14,3],[15,0,15,3],[13,0,13,3],[0,0,0,3],[1,0,1,3],[4,0,4,3],[7,0,7,3],[10,0,10,3],[2,0,2,3],[3,0,3,3],[5,0,5,3],[6,0,6,3],[8,0,8,3],[9,0,9,3],[18,5,18,8],[17,0,17,3],[16,0,16,3],[44,0,44,3],[42,0,42,3],[43,0,43,3],[18,0,18,3],[36,0,36,3],[39,0,39,3],[38,0,38,3],[40,0,40,3],[29,0,29,2],[32,0,32,3],[33,0,33,3],[34,0,34,3],[35,0,35,3]]}
[]
[]
["UNIDADE ESCOLAR"]
[{"$f":"Orçamento!$O$4","v":"CENTRO DE ENSINO EM PERÍODO INTEGRAL PEDRO XAVIER TEIXEIRA"}]
[]
["OBRA"]
[{"$f":"Orçamento!$O$7","v":"REFORMA"}]
[]
["ENDEREÇO"]
[{"$f":"Orçamento!$R$10","v":"RUA 1027 Nº 70 70, SETOR PEDRO LUDOVICO, CEP:74825-040"}]
[]
["CIDADE"]
[{"$f":"Orçamento!$V$7","v":"GOIÂNIA"}]
[]
["CRE"]
[{"$f":"Orçamento!$O$10","v":"GOIÂNIA"}]
[]
["DETALHAMENTO DA COMPOSIÇÃO DE BDI"]
["COMPOSIÇÃO BDI PARA OBRAS CIVIS",null,null,null,null,"BDI CONSTRUÇÃO E REFORMA"]
["DESCRIÇÃO","COEF.","TAXA % (a.m)","% no preço de venda",null,"Situação","1º Quartil","Médio","3º Quartil"]
["1) COFINS",1,0.03,{"$f":"C21","v":0.03},null,{"$f":"IF(OR(C21<G21,C21>I21),\"FORA DO INTERVALO\",\"OK\")","v":"OK"},0.03,0.03,0.03]
["2) PIS",1,6.4999999999999997E-3,{"$f":"C22","v":6.4999999999999997E-3},null,{"$f":"IF(OR(C22<G22,C22>I22),\"FORA DO INTERVALO\",\"OK\")","v":"OK"},6.4999999999999997E-3,6.4999999999999997E-3,6.4999999999999997E-3]
["3) ISSQN",1,0.03,{"$f":"C23*B23","v":0.03},null,"OK",0.02,3.5000000000000003E-2,0.05]
["4) CPRB",1,0,{"$f":"C24","v":0},null,"FORA DO INTERVALO",4.4999999999999998E-2,4.4999999999999998E-2,4.4999999999999998E-2]
["5) Administração Central",1,0.04,0.04,null,"OK",0.03,0.04,5.5E-2]
["6) Despesas Financeiras",1,5.5999999999999999E-3,5.5999999999999999E-3,null,"FORA DO INTERVALO",5.8999999999999999E-3,1.23E-2,1.3899999999999999E-2]
["7) Seguros + Garantias",1,1.1999999999999999E-3,1.1999999999999999E-3,null,"FORA DO INTERVALO",8.0000000000000002E-3,8.0000000000000002E-3,0.01]
["8) Risco",1,9.7000000000000003E-3,9.7000000000000003E-3,null,"OK",9.7000000000000003E-3,1.2699999999999999E-2,1.2699999999999999E-2]
["9) Lucro",1,6.3E-2,6.3E-2,null,"OK",6.1600000000000002E-2,7.3999999999999996E-2,8.9599999999999999E-2]
["BDI - FINAL",null,null,{"$f":"(((1+D25+D27+D28)*(1+D26)*(1+D29))/(1-(D21+D22+D23+D24))-1)","v":0.20338778523835055},null,{"$f":"IF(OR(D30<G30,D30>I30),\"FORA DO INTERVALO\",\"OK\")","v":"FORA DO INTERVALO"},0.2034,0.22120000000000001,0.25]
[]
["Notas:"]
["(1) e (2) Alíquota definida por lei."]
["(3) Alíquota e base de cálculo definidas pela legislação municipal."]
["(4) Alíquota definida pelas leis 12.546/11, 12844/13 e 13.161/15 (CPRB – contribuição previdenciária sobre a receita bruta)."]
["(5) Valores definidos a partir dos limites no Acórdão nº 2.622/2013 - TCU – Plenário. Valores entre o 1º e 3º quartis."]
["(6) Valor calculado pela expressão matemática do acórdão 2.369/2011 – TCU – Plenário e disponibilizado pela AGETOP em dezembro de 2018. (Foi utilizado para o cálculo a média da Taxa SELIC no período de 11/2017 a 10/2018)"]
[]
["(7) Valores definidos pela AGETOP a partir dos limites no Acórdão nº 2.622/2013 - TCU – Plenário. Valores médios. \n\nObservação da AGETOP: (Seguros contra erros de execução, incêndio e explosão, danos da natureza (vendaval, destelhamento, alagamento, inundação, desmoronamento, geadas etc.), emprego de material defeituoso ou inadequado, roubo e/ou furto qualificado, quebra de equipamentos, desmoronamento de estrutura, nas modalidades de Obras Civis em Construção (OCC); Instalação e Montagem (IM); e Obras Civis em Construção e Instalação e Montagem (OCC/IM). Bem como coberturas adicionais para ampliação dessas coberturas básicas, como: cobertura de responsabilidade civil geral, cobertura de responsabilidade civil cruzada, cobertura de despesas extraordinárias, cobertura de tumultos, cobertura de desentulho do local, cobertura de riscos do fabricante, dentre outras, incluindo o seguro de vida em grupo regido pela convenção coletiva dos trabalhadores na indústria da construção civil). A partir de 24/02/2015 por intermédio da Portaria 449/2015 a Presidência da AGETOP, na pessoa do Senhor Jayme Eduardo Rincon, determinou a exclusão dos valores referentes aos Seguros de Risco de Engenharia e Responsabilidade Civil do Profissional na composição do cálculo do B.D.I.."]
["(8) Valores definidos a partir dos limites no Acórdão nº 2.622/2013 - TCU – Plenário. Valores entre 1º e 3° quartis."]
["(9) Valores definidos a partir dos limites definidos no Acórdão nº 2.622/2013 - TCU – Plenário. Valores adotados e praticados no mercado ( “ ex ante ” ) ou aqueles entre os 1º e 3º quartis."]
[]
["(*) A fórmula para estipulação da taxa de BDI estimado adotado é a mesma que foi aplicada para a obtenção das tabelas contidas no Acórdão n. 2.622/2013 – TCUPlenário"]
[]
["Obs.: Para obras com valores superiores a R$ 20.000.000,00 sugere-se recalcular o BDI, dimensionando as taxas de administração central e lucro para patamares inferiores ao estipulado acima."]

{"sheet":"Relatório CENTRAL","index":5,"n_rows":40,"n_cols":5,"rows_kept":40,"cut":false,"hidden":false,"merged":[[7,1,7,4],[8,1,8,2],[8,3,8,4],[9,1,9,2],[10,1,10,4],[11,1,11,4],[39,1,39,2],[9,0,11,0],[0,1,0,4],[6,3,6,4],[9,3,9,4],[1,1,1,4],[2,1,2,2],[2,3,2,4],[3,1,3,2],[3,3,3,4],[4,1,4,4],[5,1,5,2],[5,3,5,4],[6,1,6,2]]}
[]
[]
[null,"UNIDADE ESCOLAR",null,"CIDADE"]
[null,{"$f":"Orçamento!$O$4","v":"CENTRO DE ENSINO EM PERÍODO INTEGRAL PEDRO XAVIER TEIXEIRA"},null,{"$f":"Orçamento!$V$7","v":"GOIÂNIA"}]
[]
[null,"OBRA",null,"CRE"]
[null,{"$f":"Orçamento!$O$7","v":"REFORMA"},null,{"$f":"Orçamento!$O$10","v":"GOIÂNIA"}]
[]
[null,"ENDEREÇO",null,"DATA"]
["FILTRO",{"$f":"Orçamento!$R$10","v":"RUA 1027 Nº 70 70, SETOR PEDRO LUDOVICO, CEP:74825-040"},null,{"$f":"Orçamento!$S$7","v":"2020-03-25"}]
[]
[null,"RELATÓRIO CENTRAL"]
["↓","CÓDIGO","ETAPA","PREÇO  (R$) C/ BDI","PARTIC  ( % )"]
[{"$f":"IF(D14>0,\"F\",\"\")","v":""},{"$f":"Orçamento!O450","v":"a."},{"$f":"Orçamento!P450","v":"SERVIÇOS PRELIMINARES"},{"$f":"Orçamento!V450","v":0},{"$f":"Orçamento!X450","v":0}]
[{"$f":"IF(D15>0,\"F\",\"\")","v":""},{"$f":"Orçamento!O451","v":"b."},{"$f":"Orçamento!P451","v":"TRANSPORTES"},{"$f":"Orçamento!V451","v":0},{"$f":"Orçamento!X451","v":0}]
["",{"$f":"Orçamento!O452","v":"c."},{"$f":"Orçamento!P452","v":"SERVIÇO EM TERRA"},{"$f":"Orçamento!V452","v":0},{"$f":"Orçamento!X452","v":0}]
["",{"$f":"Orçamento!O453","v":"d."},{"$f":"Orçamento!P453","v":"FUNDAÇÕES E SONDAGENS"},{"$f":"Orçamento!V453","v":0},{"$f":"Orçamento!X453","v":0}]
["",{"$f":"Orçamento!O454","v":"e."},{"$f":"Orçamento!P454","v":"ESTRUTURA"},{"$f":"Orçamento!V454","v":0},{"$f":"Orçamento!X454","v":0}]
["",{"$f":"Orçamento!O455","v":"f."},{"$f":"Orçamento!P455","v":"INSTALAÇÕES ELÉTRICAS"},{"$f":"Orçamento!V455","v":0},{"$f":"Orçamento!X455","v":0}]
["",{"$f":"Orçamento!O456","v":"g."},{"$f":"Orçamento!P456","v":"INSTALAÇÕES HIDROSSANITÁRIAS"},{"$f":"Orçamento!V456","v":0},{"$f":"Orçamento!X456","v":0}]
["",{"$f":"Orçamento!O457","v":"h"},{"$f":"Orçamento!P457","v":"INSTALAÇÕES ESPECIAIS"},{"$f":"Orçamento!V457","v":0},{"$f":"Orçamento!X457","v":0}]
["",{"$f":"Orçamento!O458","v":"i."},{"$f":"Orçamento!P458","v":"ALVENARIAS E DIVISÓRIAS"},{"$f":"Orçamento!V458","v":0},{"$f":"Orçamento!X458","v":0}]
["",{"$f":"Orçamento!O459","v":"j."},{"$f":"Orçamento!P459","v":"ALVENARIA AUTO-PORTANTE"},{"$f":"Orçamento!V459","v":0},{"$f":"Orçamento!X459","v":0}]
["",{"$f":"Orçamento!O460","v":"k."},{"$f":"Orçamento!P460","v":"IMPERMEABILIZAÇÃO"},{"$f":"Orçamento!V460","v":0},{"$f":"Orçamento!X460","v":0}]
["",{"$f":"Orçamento!O461","v":"l."},{"$f":"Orçamento!P461","v":"ISOLAMENTO TÉRMICO E ACÚSTICO"},{"$f":"Orçamento!V461","v":0},{"$f":"Orçamento!X461","v":0}]
["",{"$f":"Orçamento!O462","v":"m."},{"$f":"Orçamento!P462","v":"ESTRUTURA DE MADEIRA"},{"$f":"Orçamento!V462","v":0},{"$f":"Orçamento!X462","v":0}]
["",{"$f":"Orçamento!O463","v":"n."},{"$f":"Orçamento!P463","v":"ESTRUTURAS METÁLICAS"},{"$f":"Orçamento!V463","v":0},{"$f":"Orçamento!X463","v":0}]
["",{"$f":"Orçamento!O464","v":"o."},{"$f":"Orçamento!P464","v":"COBERTURAS"},{"$f":"Orçamento!V464","v":0},{"$f":"Orçamento!X464","v":0}]
["",{"$f":"Orçamento!O465","v":"p."},{"$f":"Orçamento!P465","v":"ESQUADRIAS DE MADEIRA"},{"$f":"Orçamento!V465","v":0},{"$f":"Orçamento!X465","v":0}]
["",{"$f":"Orçamento!O466","v":"q."},{"$f":"Orçamento!P466","v":"ESQUADRIAS METÁLICAS"},{"$f":"Orçamento!V466","v":0},{"$f":"Orçamento!X466","v":0}]
["",{"$f":"Orçamento!O467","v":"r."},{"$f":"Orçamento!P467","v":"VIDROS"},{"$f":"Orçamento!V467","v":0},{"$f":"Orçamento!X467","v":0}]
["",{"$f":"Orçamento!O468","v":"s."},{"$f":"Orçamento!P468","v":"REVESTIMENTO DE PAREDE"},{"$f":"Orçamento!V468","v":0},{"$f":"Orçamento!X468","v":0}]
["",{"$f":"Orçamento!O469","v":"t."},{"$f":"Orçamento!P469","v":"FORROS"},{"$f":"Orçamento!V469","v":0},{"$f":"Orçamento!X469","v":0}]
["",{"$f":"Orçamento!O470","v":"u."},{"$f":"Orçamento!P470","v":"REVESTIMENTO DE PISO"},{"$f":"Orçamento!V470","v":0},{"$f":"Orçamento!X470","v":0}]
["",{"$f":"Orçamento!O471","v":"v."},{"$f":"Orçamento!P471","v":"FERRAGENS"},{"$f":"Orçamento!V471","v":0},{"$f":"Orçamento!X471","v":0}]
["",{"$f":"Orçamento!O472","v":"w."},{"$f":"Orçamento!P472","v":"MARCENARIA"},{"$f":"Orçamento!V472","v":0},{"$f":"Orçamento!X472","v":0}]
["",{"$f":"Orçamento!O473","v":"x."},{"$f":"Orçamento!P473","v":"ADMINISTRAÇÃO"},{"$f":"Orçamento!V473","v":0},{"$f":"Orçamento!X473","v":0}]
["",{"$f":"Orçamento!O474","v":"y."},{"$f":"Orçamento!P474","v":"PINTURA"},{"$f":"Orçamento!V474","v":0},{"$f":"Orçamento!X474","v":0}]
["",{"$f":"Orçamento!O475","v":"z."},{"$f":"Orçamento!P475","v":"DIVERSOS"},{"$f":"Orçamento!V475","v":0},{"$f":"Orçamento!X475","v":0}]
["F","TOTAL GERAL DO ORÇAMENTO (R$) C/BDI",null,{"$f":"SUM(D14:D39)","v":0},{"$f":"SUM(E14:E39)","v":0}]

{"sheet":"Parc Maior Relev","index":6,"n_rows":29,"n_cols":8,"rows_kept":29,"cut":false,"hidden":false,"merged":[[0,1,0,6],[11,1,11,6],[1,1,1,6],[2,1,2,3],[2,4,2,6],[3,1,3,3],[3,4,3,6],[4,1,4,6],[5,1,5,3],[5,4,5,6],[9,1,9,3],[9,4,9,6],[10,1,10,6],[6,1,6,3],[6,4,6,6],[7,1,7,6],[10,0,12,0],[8,1,8,3],[8,4,8,6],[29,3,29,7],[27,1,27,6]]}
[]
[]
[null,"UNIDADE ESCOLAR",null,null,"CÓDIGO INEP"]
[null,{"$f":"Orçamento!$O$4","v":"CENTRO DE ENSINO EM PERÍODO INTEGRAL PEDRO XAVIER TEIXEIRA"},null,null,{"$f":"Orçamento!$V$4","v":52033562}]
[]
[null,"OBRA",null,null,"CIDADE"]
[null,{"$f":"Orçamento!$O$7","v":"REFORMA"},null,null,{"$f":"Orçamento!$V$7","v":"GOIÂNIA"}]
[]
[null,"CRE",null,null,"ÁREA TOTAL CONSTRUÍDA (M²)"]
[null,{"$f":"Orçamento!$O$10","v":"GOIÂNIA"},null,null,{"$f":"Orçamento!$S$13","v":4083.99}]
["FILTRO"]
[null,"PARCELA DE MAIOR RELEVÂNCIA"]
[null,"CÓDIGO","SERVIÇO","DESCRIÇÃO","UNID","QUANT","PARC. MAIOR RELEV (50%)"]
[{"$f":"IF(F14>0,\"F\",\"\")","v":""},70000,"INSTALAÇÕES ELÉTRICAS","INSTALAÇÕES ELÉTRICAS","KVA",{"$f":"SUMIF(Orçamento!$R$20:$R$431,'Parc Maior Relev'!D14,Orçamento!$T$20:$T$431)","v":0},{"$f":"F14*0.5","v":0}]
[null,70000,"INSTALAÇÕES ELÉTRICAS","SUBESTAÇÃO","KVA",{"$f":"SUMIF(Orçamento!$R$20:$R$431,'Parc Maior Relev'!D15,Orçamento!$T$20:$T$431)","v":0},{"$f":"F15*0.5","v":0},1]
[null,80000,"INSTALAÇÕES HIDROSSANITÁRIAS","RESERVATÓRIO","UNID",{"$f":"SUMIF(Orçamento!$R$20:$R$431,'Parc Maior Relev'!D16,Orçamento!$T$20:$T$431)","v":0},{"$f":"F16*0.5","v":0},1]
[null,160000,"COBERTURAS","TELHA CERÂMICA","M2",{"$f":"SUMIF(Orçamento!$R$20:$R$431,'Parc Maior Relev'!D17,Orçamento!$T$20:$T$431)","v":0},{"$f":"F17*0.5","v":0}]
[null,160000,"COBERTURAS","TELHA FIBROCIMENTO","M2",{"$f":"SUMIF(Orçamento!$R$20:$R$431,'Parc Maior Relev'!D18,Orçamento!$T$20:$T$431)","v":0},0]
[null,160000,"COBERTURAS","TELHA METÁLICA","M2",{"$f":"SUMIF(Orçamento!$R$20:$R$431,'Parc Maior Relev'!D19,Orçamento!$T$20:$T$431)","v":0},0]
[null,200000,"REVESTIMENTO DE PAREDE","REBOCO","M2",{"$f":"SUMIF(Orçamento!$R$20:$R$431,'Parc Maior Relev'!D20,Orçamento!$T$20:$T$431)","v":0},{"$f":"F20*0.5","v":0}]
[null,200000,"REVESTIMENTO DE PAREDE","REVESTIMENTO CERÂMICO","M2",{"$f":"SUMIF(Orçamento!$R$20:$R$431,'Parc Maior Relev'!D21,Orçamento!$T$20:$T$431)","v":0},{"$f":"F21*0.5","v":0}]
[null,210000,"FORROS","FORRO DE GESSO","M2",{"$f":"SUMIF(Orçamento!$R$20:$R$431,'Parc Maior Relev'!D22,Orçamento!$T$20:$T$431)","v":0},{"$f":"F22*0.5","v":0}]
[null,210000,"FORROS","FORRO PVC","M2",{"$f":"SUMIF(Orçamento!$R$20:$R$431,'Parc Maior Relev'!D23,Orçamento!$T$20:$T$431)","v":0},{"$f":"F23*0.5","v":0}]
[null,210000,"FORROS","FORRO ACARTONADO","M2",{"$f":"SUMIF(Orçamento!$R$20:$R$431,'Parc Maior Relev'!D24,Orçamento!$T$20:$T$431)","v":0},{"$f":"F24*0.5","v":0}]
[null,"o.","COBERTURAS","COBERTURA CERÂMICA","M2",{"$f":"1242.51","v":1242.51},621.255]
[null,{"$f":"Somatório!B37","v":"u."},"REVESTIMENTO DE PISO","PISO CONCRETO DESEMPENADO","M2",{"$f":"Orçamento!T386","v":1900.85},950.42499999999995]
["F"]
["F","(*) Para os fins do inciso I dp § 1º do Art. 30 da Lei Federal 8.666/93, são consideradas parcelas de maior relevância técnica as execuções apresentadas"]
["F"]

{"sheet":"Composições","index":7,"n_rows":224,"n_cols":10,"rows_kept":224,"cut":false,"hidden":false,"merged":[[15,0,15,9],[13,0,13,2],[13,3,13,6],[1,0,1,9],[3,7,3,9],[4,7,4,9],[6,7,6,9],[7,7,7,9],[6,0,6,6],[10,8,10,9],[13,8,13,9],[14,0,14,9],[8,0,8,9],[5,0,5,9],[2,0,2,9],[0,0,0,8],[10,0,10,2],[10,3,10,6],[11,0,11,9],[12,0,12,2],[12,3,12,6],[12,7,12,8],[7,0,7,6],[9,0,9,2],[9,3,9,6],[9,7,9,8],[3,0,3,6],[4,0,4,6],[16,5,17,5],[16,6,16,7],[16,8,16,9],[22,1,22,7],[26,1,26,7],[16,0,17,0],[16,1,17,1],[16,2,17,2],[16,3,17,3],[16,4,17,4],[28,5,29,5],[28,6,28,7],[28,8,28,9],[34,1,34,7],[38,1,38,7],[28,0,29,0],[28,1,29,1],[28,2,29,2],[28,3,29,3],[28,4,29,4],[40,5,41,5],[40,6,40,7],[40,8,40,9],[46,1,46,7],[50,1,50,7],[40,0,41,0],[40,1,41,1],[40,2,41,2],[40,3,41,3],[40,4,41,4],[52,5,53,5],[52,6,52,7],[52,8,52,9],[58,1,58,7],[62,1,62,7],[52,0,53,0],[52,1,53,1],[52,2,53,2],[52,3,53,3],[52,4,53,4],[64,5,65,5],[64,6,64,7],[64,8,64,9],[70,1,70,7],[74,1,74,7],[64,0,65,0],[64,1,65,1],[64,2,65,2],[64,3,65,3],[64,4,65,4],[76,5,77,5],[76,6,76,7],[76,8,76,9],[82,1,82,7],[86,1,86,7],[76,0,77,0],[76,1,77,1],[76,2,77,2],[76,3,77,3],[76,4,77,4],[88,5,89,5],[88,6,88,7],[88,8,88,9],[94,1,94,7],[98,1,98,7],[88,0,89,0],[88,1,89,1],[88,2,89,2],[88,3,89,3],[88,4,89,4],[100,5,101,5],[100,6,100,7],[100,8,100,9],[106,1,106,7],[110,1,110,7],[100,0,101,0],[100,1,101,1],[100,2,101,2],[100,3,101,3],[100,4,101,4],[112,5,113,5],[112,6,112,7],[112,8,112,9],[118,1,118,7],[122,1,122,7],[112,0,113,0],[112,1,113,1],[112,2,113,2],[112,3,113,3],[112,4,113,4],[124,5,125,5],[124,6,124,7],[124,8,124,9],[130,1,130,7],[134,1,134,7],[124,0,125,0],[124,1,125,1],[124,2,125,2],[124,3,125,3],[124,4,125,4],[136,5,137,5],[136,6,136,7],[136,8,136,9],[142,1,142,7],[146,1,146,7],[136,0,137,0],[136,1,137,1],[136,2,137,2],[136,3,137,3],[136,4,137,4],[148,5,149,5],[148,6,148,7],[148,8,148,9],[154,1,154,7],[158,1,158,7],[148,0,149,0],[148,1,149,1],[148,2,149,2],[148,3,149,3],[148,4,149,4],[160,5,161,5],[160,6,160,7],[160,8,160,9],[166,1,166,7],[170,1,170,7],[160,0,161,0],[160,1,161,1],[160,2,161,2],[160,3,161,3],[160,4,161,4],[172,5,173,5],[172,6,172,7],[172,8,172,9],[178,1,178,7],[182,1,182,7],[172,0,173,0],[172,1,173,1],[172,2,173,2],[172,3,173,3],[172,4,173,4],[184,5,185,5],[184,6,184,7],[184,8,184,9],[190,1,190,7],[194,1,194,7],[184,0,185,0],[184,1,185,1],[184,2,185,2],[184,3,185,3],[184,4,185,4],[196,5,197,5],[196,6,196,7],[196,8,196,9],[202,1,202,7],[206,1,206,7],[196,0,197,0],[196,1,197,1],[196,2,197,2],[196,3,197,3],[196,4,197,4],[208,5,209,5],[208,6,208,7],[208,8,208,9],[213,1,213,7],[223,1,223,7],[208,0,209,0],[208,1,209,1],[208,2,209,2],[208,3,209,3],[208,4,209,4]]}
[]
[]
[]
["UNIDADE ESCOLAR",null,null,null,null,null,null,"CÓDIGO INEP"]
[{"$f":"Orçamento!$O$4","v":"CENTRO DE ENSINO EM PERÍODO INTEGRAL PEDRO XAVIER TEIXEIRA"},null,null,null,null,null,null,{"$f":"Orçamento!$V$4","v":52033562}]
[]
["OBRA",null,null,null,null,null,null,"CIDADE"]
[{"$f":"Orçamento!$O$7","v":"REFORMA"},null,null,null,null,null,null,{"$f":"Orçamento!$V$7","v":"GOIÂNIA"}]
[]
["CRE",null,null,"ENDEREÇO",null,null,null,"REFERÊNCIA AGETOP"]
[{"$f":"Orçamento!$O$10","v":"GOIÂNIA"},null,null,{"$f":"Orçamento!$R$10","v":"RUA 1027 Nº 70 70, SETOR PEDRO LUDOVICO, CEP:74825-040"},null,null,null,{"$f":"Orçamento!$V$10","v":"DEZ/18"},{"$f":"Orçamento!$W$10","v":"ONERADA"}]
[]
["DATA",null,null,"ÁREA TOTAL CONSTRUÍDA (M²)",null,null,null,"REFERÊNCIA SINAPI"]
[{"$f":"Orçamento!$S$7","v":"2020-03-25"},null,null,{"$f":"Orçamento!$S$13","v":4083.99},null,null,null,{"$f":"Orçamento!$V$13","v":"AGO/19"},{"$f":"Orçamento!$W$13","v":"ONERADA"}]
[]
["COMPOSIÇÕES DE CUSTOS UNITÁRIOS - SEE-GO"]
[46,"FONTE","CÓDIGO","DESCRIÇÃO","UNIDADE","COEFIC.","CUSTO UNITÁRIO",null,"CUSTO  TOTAL (A) + (B) + (C) + (D) + (E)"]
[null,null,null,null,null,null,"DESONERADO","NÃO DESONER.","DESONERADO","NÃO DESONER."]
[null,"COMPOSIÇÃO","COMP 046_SEE","CAPUZ PARA PROTEÇÃO DOS PARA RAIOS","UN ",null,null,null,16.53,16.650000000000002]
[null,"AGETOP_I",8,"AJUDANTE","h     ",3.3300000000000003E-2,8.1999999999999993,9.51,0.27,0.32]
[null,"AGETOP_I",12,"ELETRICISTA","h     ",3.3300000000000003E-2,13.4,15.53,0.45,0.52]
[null,null,null,"","",null,0,0,0,0]
[null,"MÃO DE OBRA (B) - TOTAL",null,null,null,null,null,null,0.72,0.84000000000000008]
[null,"COTAÇÃO","COT 010_SEE","CAPUZ PARA PROTEÇÃO DOS PARA RAIOS","UN ",1,15.81,15.81,15.81,15.81]
[null,null,null,"","",null,0,0,0,0]
[null,null,null,"","",null,0,0,0,0]
[null,"MATERIAL (C) - TOTAL",null,null,null,null,null,null,15.81,15.81]
[]
[47,"FONTE","CÓDIGO","DESCRIÇÃO","UNIDADE","COEFIC.","CUSTO UNITÁRIO",null,"CUSTO  TOTAL (A) + (B) + (C) + (D) + (E)"]
[null,null,null,null,null,null,"DESONERADO","NÃO DESONER.","DESONERADO","NÃO DESONER."]
[null,"COMPOSIÇÃO","COMP 047_SEE","CAPUZ DE PROTEÇÃO PARA BUCHA DE TRANSFORMADOR","UN ",null,null,null,16.53,16.650000000000002]
[null,"AGETOP_I",8,"AJUDANTE","h     ",3.3300000000000003E-2,8.1999999999999993,9.51,0.27,0.32]
[null,"AGETOP_I",12,"ELETRICISTA","h     ",3.3300000000000003E-2,13.4,15.53,0.45,0.52]
[null,null,null,"","",null,0,0,0,0]
[null,"MÃO DE OBRA (B) - TOTAL",null,null,null,null,null,null,0.72,0.84000000000000008]
[null,"COTAÇÃO","COT 011_SEE","CAPUZ DE PROTEÇÃO PARA BUCHA DE TRANSFORMADOR","UN ",1,15.81,15.81,15.81,15.81]
[null,null,null,"","",null,0,0,0,0]
[null,null,null,"","",null,0,0,0,0]
[null,"MATERIAL (C) - TOTAL",null,null,null,null,null,null,15.81,15.81]
[]
[48,"FONTE","CÓDIGO","DESCRIÇÃO","UNIDADE","COEFIC.","CUSTO UNITÁRIO",null,"CUSTO  TOTAL (A) + (B) + (C) + (D) + (E)"]
[null,null,null,null,null,null,"DESONERADO","NÃO DESONER.","DESONERADO","NÃO DESONER."]
[null,"COMPOSIÇÃO","COMP 048_SEE","HASTE ROSQUEADA \"TIRANTE\" 3/8\"","M",null,null,null,14.02,15.39]
[null,"AGETOP_I",8,"AJUDANTE","h     ",0.4,8.1999999999999993,9.51,3.28,3.8]
[null,"AGETOP_I",12,"ELETRICISTA","h     ",0.4,13.4,15.53,5.36,6.21]
[null,null,null,"","",null,0,0,0,0]
[null,"MÃO DE OBRA (B) - TOTAL",null,null,null,null,null,null,8.64,10.01]
[null,"COTAÇÃO","COT 012_SEE","HASTE ROSQUEADA \"TIRANTE\" 3/8\"","M",1,5.3833333333333329,5.3833333333333329,5.38,5.38]
[null,null,null,"","",null,0,0,0,0]
[null,null,null,"","",null,0,0,0,0]
[null,"MATERIAL (C) - TOTAL",null,null,null,null,null,null,5.38,5.38]
[]
[49,"FONTE","CÓDIGO","DESCRIÇÃO","UNIDADE","COEFIC.","CUSTO UNITÁRIO",null,"CUSTO  TOTAL (A) + (B) + (C) + (D) + (E)"]
[null,null,null,null,null,null,"DESONERADO","NÃO DESONER.","DESONERADO","NÃO DESONER."]
[null,"COMPOSIÇÃO","COMP 049_SEE","PORCA SEXTAVADA 3/8\"","UN ",null,null,null,0.2,0.22]
[null,"AGETOP_I",8,"AJUDANTE","h     ",8.9999999999999993E-3,8.1999999999999993,9.51,7.0000000000000007E-2,0.09]
[null,null,null,"","",null,0,0,0,0]
[null,null,null,"","",null,0,0,0,0]
[null,"MÃO DE OBRA (B) - TOTAL",null,null,null,null,null,null,7.0000000000000007E-2,0.09]
[null,"COTAÇÃO","COT 013_SEE","PORCA SEXTAVADA 3/8\"","UN ",1,0.13,0.13,0.13,0.13]
[null,null,null,"","",null,0,0,0,0]
[null,null,null,"","",null,0,0,0,0]
[null,"MATERIAL (C) - TOTAL",null,null,null,null,null,null,0.13,0.13]
[]
[387,"FONTE","CÓDIGO","DESCRIÇÃO","UNIDADE","COEFIC.","CUSTO UNITÁRIO",null,"CUSTO  TOTAL (A) + (B) + (C) + (D) + (E)"]
[null,null,null,null,null,null,"DESONERADO","NÃO DESONER.","DESONERADO","NÃO DESONER."]
[null,"COMPOSIÇÃO","COMP 387_SEE","LÂMPADA LED TUBULAR 18W ","UN ",null,null,null,22.28,22.330000000000002]
[null,"AGETOP_I",8,"AJUDANTE","h     ",1.4999999999999999E-2,8.1999999999999993,9.51,0.12,0.14000000000000001]
[null,"AGETOP_I",12,"ELETRICISTA","h     ",1.4999999999999999E-2,13.4,15.53,0.2,0.23]
[null,null,null,"","",null,0,0,0,0]
[null,"MÃO DE OBRA (B) - TOTAL",null,null,null,null,null,null,0.32,0.37]
[null,"COTAÇÃO","COT 195_SEE","LÂMPADA LED TUBULAR 18W ","UN",1,21.959999999999997,21.959999999999997,21.96,21.96]
[null,null,null,"","",null,0,0,0,0]
[null,null,null,"","",null,0,0,0,0]
[null,"MATERIAL (C) - TOTAL",null,null,null,null,null,null,21.96,21.96]
[]
[382,"FONTE","CÓDIGO","DESCRIÇÃO","UNIDADE","COEFIC.","CUSTO UNITÁRIO",null,"CUSTO  TOTAL (A) + (B) + (C) + (D) + (E)"]
[null,null,null,null,null,null,"DESONERADO","NÃO DESONER.","DESONERADO","NÃO DESONER."]
[null,"COMPOSIÇÃO","COMP 382_SEE","TE DE REDUCAO DE FERRO GALVANIZADO, COM ROSCA BSP, DE 3/4\" X 1/2\"","UN ",null,null,null,21.93,24.020000000000003]
[null,"AGETOP_I",8,"AJUDANTE","h     ",0.6,8.1999999999999993,9.51,4.92,5.71]
[null,"AGETOP_I",11,"ENCANADOR","h     ",0.61050000000000004,13.4,15.53,8.18,9.48]
[null,null,null,"","",null,0,0,0,0]
[null,"MÃO DE OBRA (B) - TOTAL",null,null,null,null,null,null,13.1,15.190000000000001]
[null,"SINAPI_I",3146,"FITA VEDA ROSCA EM ROLOS DE 18 MM X 10 M (L X C)                                                                                                                                                                                                                                                                                                                                                                                                                                                          ","UN    ",0.12075471698113208,3.9,3.9,0.47,0.47]
[null,"SINAPI_I",6302,"TE DE REDUCAO DE FERRO GALVANIZADO, COM ROSCA BSP, DE 3/4\" X 1/2\"                                                                                                                                                                                                                                                                                                                                                                                                                                         ","UN    ",1,8.36,8.36,8.36,8.36]
[null,null,null,"","",null,0,0,0,0]
[null,"MATERIAL (C) - TOTAL",null,null,null,null,null,null,8.83,8.83]
[]
[383,"FONTE","CÓDIGO","DESCRIÇÃO","UNIDADE","COEFIC.","CUSTO UNITÁRIO",null,"CUSTO  TOTAL (A) + (B) + (C) + (D) + (E)"]
[null,null,null,null,null,null,"DESONERADO","NÃO DESONER.","DESONERADO","NÃO DESONER."]
[null,"COMPOSIÇÃO","COMP 383_SEE","BUCHA DE REDUCAO DE FERRO GALVANIZADO, COM ROSCA BSP, DE 1/2\" X 1/4\"","UN ",null,null,null,6.87,7.42]
[null,"AGETOP_I",8,"AJUDANTE","h     ",0.16,8.1999999999999993,9.51,1.31,1.52]
[null,"AGETOP_I",11,"ENCANADOR","h     ",0.16,13.4,15.53,2.14,2.48]
[null,null,null,"","",null,0,0,0,0]
[null,"MÃO DE OBRA (B) - TOTAL",null,null,null,null,null,null,3.45,4]
[null,"AGETOP_I","H689","FITA VEDAROSCA 12 MM","m",1.2,0.28000000000000003,0.28000000000000003,0.34,0.34]
[null,"SINAPI_I",770,"BUCHA DE REDUCAO DE FERRO GALVANIZADO, COM ROSCA BSP, DE 1/2\" X 1/4\"                                                                                                                                                                                                                                                                                                                                                                                                                                      ","UN    ",1,3.08,3.08,3.08,3.08]
[null,null,null,"","",null,0,0,0,0]
[null,"MATERIAL (C) - TOTAL",null,null,null,null,null,null,3.42,3.42]
[]
[212,"FONTE","CÓDIGO","DESCRIÇÃO","UNIDADE","COEFIC.","CUSTO UNITÁRIO",null,"CUSTO  TOTAL (A) + (B) + (C) + (D) + (E)"]
[null,null,null,null,null,null,"DESONERADO","NÃO DESONER.","DESONERADO","NÃO DESONER."]
[null,"COMPOSIÇÃO","COMP 212_SEE","NIPLE DE REDUÇÃO 1/2\" X 1/4\" BSP","UN ",null,null,null,9.5,10.050000000000001]
[null,"AGETOP_I",8,"AJUDANTE","h     ",0.16,8.1999999999999993,9.51,1.31,1.52]
[null,"AGETOP_I",11,"ENCANADOR","h     ",0.16,13.4,15.53,2.14,2.48]
[null,null,null,"","",null,0,0,0,0]
[null,"MÃO DE OBRA (B) - TOTAL",null,null,null,null,null,null,3.45,4]
[null,"COTAÇÃO","COT 103_SEE","NIPLE DE REDUÇÃO 1/2\" X 1/4\" BSP","UN",1,6.0533333333333337,6.0533333333333337,6.05,6.05]
[null,null,null,"","",null,0,0,0,0]
[null,null,null,"","",null,0,0,0,0]
[null,"MATERIAL (C) - TOTAL",null,null,null,null,null,null,6.05,6.05]
[]
[213,"FONTE","CÓDIGO","DESCRIÇÃO","UNIDADE","COEFIC.","CUSTO UNITÁRIO",null,"CUSTO  TOTAL (A) + (B) + (C) + (D) + (E)"]
[null,null,null,null,null,null,"DESONERADO","NÃO DESONER.","DESONERADO","NÃO DESONER."]
[null,"COMPOSIÇÃO","COMP 213_SEE","NIPLE DE REDUÇÃO 3/4\" X 1/2\" BSP","UN ",null,null,null,13.16,13.71]
[null,"AGETOP_I",8,"AJUDANTE","h     ",0.16,8.1999999999999993,9.51,1.31,1.52]
[null,"AGETOP_I",11,"ENCANADOR","h     ",0.16,13.4,15.53,2.14,2.48]
[null,null,null,"","",null,0,0,0,0]
[null,"MÃO DE OBRA (B) - TOTAL",null,null,null,null,null,null,3.45,4]
[null,"COTAÇÃO","COT 104_SEE","NIPLE DE REDUÇÃO 3/4\" X 1/2\" BSP","UN",1,9.7099999999999991,9.7099999999999991,9.7100000000000009,9.7100000000000009]
[null,null,null,"","",null,0,0,0,0]
[null,null,null,"","",null,0,0,0,0]
[null,"MATERIAL (C) - TOTAL",null,null,null,null,null,null,9.7100000000000009,9.7100000000000009]
[]
[237,"FONTE","CÓDIGO","DESCRIÇÃO","UNIDADE","COEFIC.","CUSTO UNITÁRIO",null,"CUSTO  TOTAL (A) + (B) + (C) + (D) + (E)"]
[null,null,null,null,null,null,"DESONERADO","NÃO DESONER.","DESONERADO","NÃO DESONER."]
[null,"COMPOSIÇÃO","COMP 237_SEE","FITA ANTICORROSIVA","M",null,null,null,11.92,12.61]
[null,"AGETOP_I",8,"AJUDANTE","h     ",0.2,8.1999999999999993,9.51,1.64,1.9]
[null,"AGETOP_I",12,"ELETRICISTA","h     ",0.2,13.4,15.53,2.68,3.11]
[null,null,null,"","",null,0,0,0,0]
[null,"MÃO DE OBRA (B) - TOTAL",null,null,null,null,null,null,4.32,5.01]
[null,"SINAPI_I",39634,"FITA ADESIVA ANTICORROSIVA DE PVC FLEXIVEL, COR PRETA, PARA PROTECAO TUBULACAO, 50 MM X 30 M (L X C), E= *0,25* MM                                                                                                                                                                                                                                                                                                                                                                                        ","M     ",1,7.6,7.6,7.6,7.6]
[null,null,null,"","",null,0,0,0,0]
[null,null,null,"","",null,0,0,0,0]
[null,"MATERIAL (C) - TOTAL",null,null,null,null,null,null,7.6,7.6]
[]
[542,"FONTE","CÓDIGO","DESCRIÇÃO","UNIDADE","COEFIC.","CUSTO UNITÁRIO",null,"CUSTO  TOTAL (A) + (B) + (C) + (D) + (E)"]
[null,null,null,null,null,null,"DESONERADO","NÃO DESONER.","DESONERADO","NÃO DESONER."]
[null,"COMPOSIÇÃO","COMP 542_SEE","VÁLVULA UGV 3/4\" (S) LATÃO","UN ",null,null,null,25.17,26.66]
[null,"AGETOP_I",8,"AJUDANTE","h     ",0.432,8.1999999999999993,9.51,3.54,4.1100000000000003]
[null,"AGETOP_I",11,"ENCANADOR","h     ",0.432,13.4,15.53,5.79,6.71]
[null,null,null,"","",null,0,0,0,0]
[null,"MÃO DE OBRA (B) - TOTAL",null,null,null,null,null,null,9.33,10.82]
[null,"COTAÇÃO","COT 281_SEE","VÁLVULA UGV 3/4\" (S) LATÃO","UN ",1,15.836666666666666,15.836666666666666,15.84,15.84]
[null,null,null,"","",null,0,0,0,0]
[null,null,null,"","",null,0,0,0,0]
[null,"MATERIAL (C) - TOTAL",null,null,null,null,null,null,15.84,15.84]
[]
[543,"FONTE","CÓDIGO","DESCRIÇÃO","UNIDADE","COEFIC.","CUSTO UNITÁRIO",null,"CUSTO  TOTAL (A) + (B) + (C) + (D) + (E)"]
[null,null,null,null,null,null,"DESONERADO","NÃO DESONER.","DESONERADO","NÃO DESONER."]
[null,"COMPOSIÇÃO","COMP 543_SEE","VÁLVULA UGV 1/2\" (S) LATÃO","UN ",null,null,null,24.5,25.990000000000002]
[null,"AGETOP_I",8,"AJUDANTE","h     ",0.432,8.1999999999999993,9.51,3.54,4.1100000000000003]
[null,"AGETOP_I",11,"ENCANADOR","h     ",0.432,13.4,15.53,5.79,6.71]
[null,null,null,"","",null,0,0,0,0]
[null,"MÃO DE OBRA (B) - TOTAL",null,null,null,null,null,null,9.33,10.82]
[null,"COTAÇÃO","COT 282_SEE","VÁLVULA UGV 1/2\" (S) LATÃO","UN ",1,15.166666666666666,15.166666666666666,15.17,15.17]
[null,null,null,"","",null,0,0,0,0]
[null,null,null,"","",null,0,0,0,0]
[null,"MATERIAL (C) - TOTAL",null,null,null,null,null,null,15.17,15.17]
[]
[211,"FONTE","CÓDIGO","DESCRIÇÃO","UNIDADE","COEFIC.","CUSTO UNITÁRIO",null,"CUSTO  TOTAL (A) + (B) + (C) + (D) + (E)"]
[null,null,null,null,null,null,"DESONERADO","NÃO DESONER.","DESONERADO","NÃO DESONER."]
[null,"COMPOSIÇÃO","COMP 211_SEE","REGULADOR DE 2º ESTÁGIO 5KG/H","UN ",null,null,null,85.46,89.419999999999987]
[null,"AGETOP_I",8,"AJUDANTE","h     ",1.1499999999999999,8.1999999999999993,9.51,9.43,10.94]
[null,"AGETOP_I",11,"ENCANADOR","h     ",1.1499999999999999,13.4,15.53,15.41,17.86]
[null,null,null,"","",null,0,0,0,0]
[null,"MÃO DE OBRA (B) - TOTAL",null,null,null,null,null,null,24.84,28.799999999999997]
[null,"COTAÇÃO","COT 102_SEE","REGULADOR DE 2º ESTÁGIO 5KG/H","UN",1,59.833333333333336,59.833333333333336,59.83,59.83]
[null,"AGETOP_I","H689","FITA VEDAROSCA 12 MM","m",2.82,0.28000000000000003,0.28000000000000003,0.79,0.79]
[null,null,null,"","",null,0,0,0,0]
[null,"MATERIAL (C) - TOTAL",null,null,null,null,null,null,60.62,60.62]
[]
[210,"FONTE","CÓDIGO","DESCRIÇÃO","UNIDADE","COEFIC.","CUSTO UNITÁRIO",null,"CUSTO  TOTAL (A) + (B) + (C) + (D) + (E)"]
[null,null,null,null,null,null,"DESONERADO","NÃO DESONER.","DESONERADO","NÃO DESONER."]
[null,"COMPOSIÇÃO","COMP 210_SEE","REGULADOR DE 1º ESTÁGIO 60KG/H MODELO AP-40  COM MANÔMETRO","UN ",null,null,null,231.21,235.17000000000002]
[null,"AGETOP_I",8,"AJUDANTE","h     ",1.1499999999999999,8.1999999999999993,9.51,9.43,10.94]
[null,"AGETOP_I",11,"ENCANADOR","h     ",1.1499999999999999,13.4,15.53,15.41,17.86]
[null,null,null,"","",null,0,0,0,0]
[null,"MÃO DE OBRA (B) - TOTAL",null,null,null,null,null,null,24.84,28.799999999999997]
[null,"COTAÇÃO","COT 101_SEE","REGULADOR DE 1º ESTÁGIO 60KG/H MODELO AP-40  COM MANÔMETRO","UN",1,205.57666666666668,205.57666666666668,205.58,205.58]
[null,"AGETOP_I","H689","FITA VEDAROSCA 12 MM","m",2.82,0.28000000000000003,0.28000000000000003,0.79,0.79]
[null,null,null,"","",null,0,0,0,0]
[null,"MATERIAL (C) - TOTAL",null,null,null,null,null,null,206.37,206.37]
[]
[235,"FONTE","CÓDIGO","DESCRIÇÃO","UNIDADE","COEFIC.","CUSTO UNITÁRIO",null,"CUSTO  TOTAL (A) + (B) + (C) + (D) + (E)"]
[null,null,null,null,null,null,"DESONERADO","NÃO DESONER.","DESONERADO","NÃO DESONER."]
[null,"COMPOSIÇÃO","COMP 235_SEE","PLACA DE SINALIZAÇÃO EM PVC COD 01 - (300X300) PROIBIDO FUMAR","UN ",null,null,null,24.109999999999996,24.229999999999997]
[null,"AGETOP_I",5,"SERVENTE","h     ",0.09,8.1999999999999993,9.51,0.74,0.86]
[null,null,null,"","",null,0,0,0,0]
[null,null,null,"","",null,0,0,0,0]
[null,"MÃO DE OBRA (B) - TOTAL",null,null,null,null,null,null,0.74,0.86]
[null,"AGETOP_I",3070,"BUCHA DE NYLON S-6","un",2,0.04,0.04,0.08,0.08]
[null,"AGETOP_I",3393,"PARAFUSO P/BUCHA S-6","un",2,0.08,0.08,0.16,0.16]
[null,"SINAPI_I",37556,"PLACA DE SINALIZACAO DE SEGURANCA CONTRA INCENDIO, FOTOLUMINESCENTE, QUADRADA, *20 X 20* CM, EM PVC *2* MM ANTI-CHAMAS (SIMBOLOS, CORES E PICTOGRAMAS CONFORME NBR 13434)                                                                                                                                                                                                                                                                                                                                 ","UN    ",1,23.13,23.13,23.13,23.13]
[null,"MATERIAL (C) - TOTAL",null,null,null,null,null,null,23.369999999999997,23.369999999999997]
[]
[236,"FONTE","CÓDIGO","DESCRIÇÃO","UNIDADE","COEFIC.","CUSTO UNITÁRIO",null,"CUSTO  TOTAL (A) + (B) + (C) + (D) + (E)"]
[null,null,null,null,null,null,"DESONERADO","NÃO DESONER.","DESONERADO","NÃO DESONER."]
[null,"COMPOSIÇÃO","COMP 236_SEE","PLACA DE SINALIZAÇÃO EM PVC COD 06 - (300X300) PERIGO INFLAMÁVEL","UN ",null,null,null,24.109999999999996,24.229999999999997]
[null,"AGETOP_I",5,"SERVENTE","h     ",0.09,8.1999999999999993,9.51,0.74,0.86]
[null,null,null,"","",null,0,0,0,0]
[null,null,null,"","",null,0,0,0,0]
[null,"MÃO DE OBRA (B) - TOTAL",null,null,null,null,null,null,0.74,0.86]
[null,"AGETOP_I",3070,"BUCHA DE NYLON S-6","un",2,0.04,0.04,0.08,0.08]
[null,"AGETOP_I",3393,"PARAFUSO P/BUCHA S-6","un",2,0.08,0.08,0.16,0.16]
[null,"SINAPI_I",37556,"PLACA DE SINALIZACAO DE SEGURANCA CONTRA INCENDIO, FOTOLUMINESCENTE, QUADRADA, *20 X 20* CM, EM PVC *2* MM ANTI-CHAMAS (SIMBOLOS, CORES E PICTOGRAMAS CONFORME NBR 13434)                                                                                                                                                                                                                                                                                                                                 ","UN    ",1,23.13,23.13,23.13,23.13]
[null,"MATERIAL (C) - TOTAL",null,null,null,null,null,null,23.369999999999997,23.369999999999997]
[]
[7,"FONTE","CÓDIGO","DESCRIÇÃO","UNIDADE","COEFIC.","CUSTO UNITÁRIO",null,"CUSTO  TOTAL (A) + (B) + (C) + (D) + (E)"]
[null,null,null,null,null,null,"DESONERADO","NÃO DESONER.","DESONERADO","NÃO DESONER."]
[null,"COMPOSIÇÃO","COMP 007_SEE","GUICHÊ CANTONEIRA/GRADE PARA VIDRO","M²","-","-","-",227.67000000000002,234.31]
[null,"AGETOP_I",4,"PEDREIRO","h     ",2.5,13.4,15.53,33.5,38.83]
[null,"AGETOP_I",5,"SERVENTE","h     ",1,8.1999999999999993,9.51,8.1999999999999993,9.51]
[null,"MÃO DE OBRA (B) - TOTAL",null,null,null,null,null,null,41.7,48.339999999999996]
[null,"AGETOP_I",104,"AREIA MEDIA ","m3",9.7000000000000003E-3,82.85,82.85,0.8,0.8]
[null,"AGETOP_I",1221,"CAL HIDRATADA","Kg",0.73,0.54,0.54,0.39,0.39]
[null,"AGETOP_I",1215,"CIMENTO PORTLAND C.P. 32","Kg",2.67,0.39,0.39,1.04,1.04]
[null,"AGETOP_I",2470,"FERRO CANTONEIRA 1/8\" X 7/8\"","Kg",3.5478000000000001,4.3899999999999997,4.3899999999999997,15.57,15.57]
[null,"AGETOP_I",2423,"FERRO CANTONEIRA 1/8\" X 3/4\"","Kg",7.9390000000000001,4.87,4.87,38.659999999999997,38.659999999999997]
[null,"AGETOP_I",2372,"CHAPA PERFILADA No. 18","Kg",13.320600000000001,5.42,5.42,72.2,72.2]
[null,"SINAPI_I",11552,"PERFIL U / CANALETA DE ALUMINIO, DE ABAS IGUAIS, 1/2\" (1,27 X 1,27 CM), PARA PORTA OU JANELA DE CORRER                                                                                                                                                                                                                                                                                                                                                                                                    ","M     ",1.306,7.84,7.84,10.24,10.24]
[null,"AGETOP_I",2898,"FABRICAÇÃO / MONTAGEM","un",1,36.729999999999997,36.729999999999997,36.729999999999997,36.729999999999997]
[null,"AGETOP_I",2529,"FECHO FIO REDONDO 4\" ZINCADO C/PARAFUSO DA SOPRANO OU EQUIVALENTE","un",2,5.17,5.17,10.34,10.34]
[null,"MATERIAL (C) - TOTAL",null,null,null,null,null,null,185.97,185.97]