{"text_format":"1","workbook":"xlsx","n_sheets":8,"sheets":["Orçamento","Resumo ","Somatório","Cronog_60_Dias","Composição BDI","Relatório CENTRAL","Parc Maior Relev","Composições"],"not_rendered":{"charts":0,"images":3,"macros":1,"external_links":0,"defined_names":79,"comments":3,"pivot_tables":0},"unopened":[],"bounds":{"document_bytes":16777216,"sheet_cells":100000,"rows_first":2000,"rows_last":500,"rows_between":2000,"halvings":0,"cell_chars":16384,"cell_head_chars":4096},"cells_cut":0,"cells_raw":0,"read":"whole","date_system":"1900"}

{"sheet":"Orçamento","index":0,"n_rows":399,"n_cols":24,"rows_kept":399,"cut":false,"hidden":false,"merged":[[379,15,379,17],[379,18,379,20],[379,21,379,22],[335,16,335,22],[391,18,391,20],[391,21,391,22],[386,15,386,17],[386,18,386,20],[386,21,386,22],[387,15,387,17],[387,18,387,20],[387,21,387,22],[388,15,388,17],[388,18,388,20],[388,21,388,22],[380,18,380,20],[380,21,380,22],[381,15,381,17],[381,18,381,20],[381,21,381,22],[382,15,382,17],[382,18,382,20],[382,21,382,22],[377,15,377,17],[377,18,377,20],[377,21,377,22],[378,15,378,17],[367,14,367,17],[374,15,374,17],[340,15,340,17],[395,18,395,20],[395,21,395,22],[383,15,383,17],[383,18,383,20],[383,21,383,22],[384,15,384,17],[384,18,384,20],[384,21,384,22],[385,15,385,17],[385,18,385,20],[385,21,385,22],[389,15,389,17],[389,18,389,20],[389,21,389,22],[390,15,390,17],[390,18,390,20],[390,21,390,22],[391,15,391,17],[380,15,380,17],[378,18,378,20],[378,21,378,22],[398,18,398,20],[398,21,398,22],[395,14,395,17],[392,15,392,17],[392,18,392,20],[392,21,392,22],[393,15,393,17],[393,18,393,20],[393,21,393,22],[394,15,394,17],[394,18,394,20],[394,21,394,22],[397,18,397,20],[397,21,397,22],[396,18,396,20],[396,21,396,22],[373,14,373,23],[374,18,374,20],[374,21,374,22],[375,15,375,17],[375,18,375,20],[375,21,375,22],[376,15,376,17],[376,18,376,20],[376,21,376,22],[331,16,331,22],[332,16,332,22],[333,16,333,22],[3,21,3,22],[2,21,2,22],[5,21,5,22],[10,14,10,23],[13,14,13,23],[6,21,6,22],[9,17,9,20],[2,14,2,20],[3,14,3,20],[5,18,5,20],[6,18,6,20],[11,18,11,20],[12,18,12,20],[6,14,6,17],[5,14,5,17],[353,15,353,17],[354,15,354,17],[355,15,355,17],[356,15,356,17],[357,15,357,17],[358,15,358,17],[359,15,359,17],[360,15,360,17],[361,15,361,17],[341,15,341,17],[342,15,342,17],[343,15,343,17],[344,15,344,17],[345,15,345,17],[346,15,346,17],[347,15,347,17],[348,15,348,17],[349,15,349,17],[362,15,362,17],[363,15,363,17],[364,15,364,17],[365,15,365,17],[366,15,366,17],[339,14,339,23],[328,20,328,21],[327,20,327,21],[323,17,328,17],[323,20,323,21],[340,18,340,20],[340,21,340,22],[341,18,341,20],[341,21,341,22],[329,20,329,21],[349,18,349,20],[349,21,349,22],[350,18,350,20],[350,21,350,22],[351,18,351,20],[351,21,351,22],[352,18,352,20],[352,21,352,22],[364,18,364,20],[367,18,367,20],[367,21,367,22],[364,21,364,22],[365,18,365,20],[365,21,365,22],[366,18,366,20],[366,21,366,22],[356,18,356,20],[356,21,356,22],[363,18,363,20],[363,21,363,22],[358,21,358,22],[359,18,359,20],[359,21,359,22],[361,18,361,20],[357,18,357,20],[357,21,357,22],[358,18,358,20],[368,18,368,20],[368,21,368,22],[355,18,355,20],[355,21,355,22],[348,18,348,20],[348,21,348,22],[370,18,370,20],[370,21,370,22],[324,20,324,21],[346,18,346,20],[346,21,346,22],[347,18,347,20],[347,21,347,22],[345,18,345,20],[345,21,345,22],[354,18,354,20],[325,20,325,21],[336,18,336,22],[342,18,342,20],[342,21,342,22],[343,18,343,20],[343,21,343,22],[344,18,344,20],[344,21,344,22],[334,16,334,22],[8,12,9,12],[369,18,369,20],[369,21,369,22],[0,14,0,22],[8,14,8,16],[9,14,9,16],[11,14,11,16],[12,14,12,16],[14,14,14,22],[1,14,1,22],[4,14,4,22],[7,14,7,22],[353,18,353,20],[353,21,353,22],[361,21,361,22],[350,15,350,17],[351,15,351,17],[352,15,352,17],[354,21,354,22],[362,18,362,20],[362,21,362,22],[360,18,360,20],[360,21,360,22]]}
[]
[]
[null,null,null,null,null,null,null,null,null,null,null,null,null,null,"UNIDADE ESCOLAR",null,null,null,null,null,null,"CÓDIGO INEP"]
[null,null,null,null,null,null,null,null,null,null,null,null,null,null,"COLÉGIO ESTADUAL DA POLÍCIA MILITAR DE GOIÁS SILVIO DE CASTRO RIBEIRO - JARAGUÁ",null,null,null,null,null,null,52024628]
[]
["Nmax",null,null,null,null,null,null,null,null,null,null,null,"Ajustar altura?",null,"OBRA",null,null,null,"DATA",null,null,"CIDADE"]
[{"$f":"MAX($C$18:$C$323)","v":3},null,null,null,null,null,null,null,null,null,null,null,"NÃO",null,"REFORMA E AMPLIAÇÃO",null,null,null,"2020-03-31",null,null,"JARAGUÁ"]
[]
[null,null,null,null,null,null,null,null,null,null,null,null,"",null,"CRE",null,null,"ENDEREÇO",null,null,null,"REFERÊNCIA AGETOP"]
[null,null,null,null,null,null,null,null,null,null,null,null,null,null,"GOIANÉSIA",null,null,"RUA MARIA DA MATA RIOS S/N, CENTRO, CEP:76330-000",null,null,null,"DEZ/18","ONERADA"]
[]
[null,null,null,null,null,null,null,null,null,null,null,null,null,null,"ÁREA EXISTENTE (M²)",null,null,"ÁREA A CONSTRUIR (M²)","ÁREA TOTAL CONSTRUÍDA (M²)",null,null,"REFERÊNCIA SINAPI"]
[null,null,null,null,null,null,null,null,null,null,null,null,null,null,2087.91,null,null,190.26,2278.17,null,null,"MAR/19","ONERADA"]
[]
[null,null,null,null,null,null,null,null,null,null,null,"FILTRO",null,null,"PLANILHA ORÇAMENTÁRIA"]
{"$rows_left_out":385}
{"sheet":"Resumo ","index":1,"n_rows":39,"n_cols":9,"rows_kept":39,"cut":false,"hidden":false,"merged":[[13,0,14,0],[34,2,34,3],[35,2,35,3],[31,2,31,3],[32,2,32,3],[33,2,33,3],[28,2,28,3],[29,2,29,3],[30,2,30,3],[0,1,0,8],[36,1,36,5],[2,1,2,5],[3,1,3,5],[5,1,5,5],[6,1,6,5],[8,1,8,5],[9,1,9,5],[11,3,11,5],[12,3,12,5],[10,1,10,8],[11,6,11,8],[12,6,12,8],[25,2,25,3],[21,2,21,3],[22,2,22,3],[6,6,6,8],[7,1,7,8],[8,6,8,8],[9,6,9,8],[13,1,13,8],[1,1,1,8],[2,6,2,8],[3,6,3,8],[4,1,4,8],[5,6,5,8],[42,3,42,7],[11,1,11,2],[12,1,12,2],[15,2,15,3],[16,2,16,3],[14,1,14,8],[17,2,17,3],[23,2,23,3],[18,2,18,3],[19,2,19,3],[20,2,20,3],[41,3,41,7],[24,2,24,3],[26,2,26,3],[27,2,27,3],[38,1,38,8]]}
[]
[]
[null,"UNIDADE ESCOLAR",null,null,null,null,"CÓDIGO INEP"]
[null,{"$f":"Orçamento!$O$4","v":"COLÉGIO ESTADUAL DA POLÍCIA MILITAR DE GOIÁS SILVIO DE CASTRO RIBEIRO - JARAGUÁ"},null,null,null,null,{"$f":"Orçamento!V4","v":52024628}]
[]
[null,"OBRA",null,null,null,null,"CIDADE"]
[null,{"$f":"Orçamento!$O$7","v":"REFORMA E AMPLIAÇÃO"},null,null,null,null,{"$f":"Orçamento!$V$7","v":"JARAGUÁ"}]
[]
[null,"ENDEREÇO",null,null,null,null,"CRE"]
[null,{"$f":"Orçamento!$R$10","v":"RUA MARIA DA MATA RIOS S/N, CENTRO, CEP:76330-000"},null,null,null,null,{"$f":"Orçamento!$O$10","v":"GOIANÉSIA"}]
[]
[null,"REFERÊNCIA",null,"DATA",null,null,"ÁREA TOTAL CONSTRUÍDA (M²)"]
[null,{"$f":"CONCATENATE(\"AGETOP E SINAPI - \",Orçamento!$W$10)","v":"AGETOP E SINAPI - ONERADA"},null,{"$f":"Orçamento!$S$7","v":"2020-03-31"},null,null,{"$f":"Orçamento!$S$13","v":2278.17}]
["FILTRO"]
[null,"RESUMO GERAL DO ORÇAMENTO"]
{"$rows_left_out":25}
{"sheet":"Somatório","index":2,"n_rows":45,"n_cols":6,"rows_kept":45,"cut":false,"hidden":false,"merged":[[13,0,14,0],[42,1,42,2],[44,1,44,5],[47,3,47,5],[48,3,48,5],[13,1,13,5],[9,1,9,3],[9,4,9,5],[11,1,11,2],[11,4,11,5],[12,1,12,2],[12,4,12,5],[0,1,0,5],[14,1,14,5],[2,1,2,3],[2,4,2,5],[3,1,3,3],[3,4,3,5],[5,1,5,3],[5,4,5,5],[6,1,6,3],[6,4,6,5],[8,1,8,3],[8,4,8,5],[1,1,1,5],[4,1,4,5],[7,1,7,5],[10,1,10,5]]}
[]
[]
[null,"UNIDADE ESCOLAR",null,null,"CÓDIGO INEP"]
[null,{"$f":"Orçamento!$O$4","v":"COLÉGIO ESTADUAL DA POLÍCIA MILITAR DE GOIÁS SILVIO DE CASTRO RIBEIRO - JARAGUÁ"},null,null,{"$f":"Orçamento!V4","v":52024628}]
[]
[null,"OBRA",null,null,"CIDADE"]
[null,{"$f":"Orçamento!$O$7","v":"REFORMA E AMPLIAÇÃO"},null,null,{"$f":"Orçamento!$V$7","v":"JARAGUÁ"}]
[]
[null,"ENDEREÇO",null,null,"CRE"]
[null,{"$f":"Orçamento!$R$10","v":"RUA MARIA DA MATA RIOS S/N, CENTRO, CEP:76330-000"},null,null,{"$f":"Orçamento!$O$10","v":"GOIANÉSIA"}]
[]
[null,"REFERÊNCIA",null,"DATA","ÁREA TOTAL CONSTRUÍDA (M²)"]
[null,{"$f":"CONCATENATE(\"AGETOP E SINAPI - \",Orçamento!$W$10)","v":"AGETOP E SINAPI - ONERADA"},null,{"$f":"Orçamento!$S$7","v":"2020-03-31"},{"$f":"Orçamento!$S$13","v":2278.17}]
["FILTRO"]
[null,"SOMATÓRIO DE SERVIÇOS"]
{"$rows_left_out":31}
{"sheet":"Cronog_60_Dias","index":3,"n_rows":99,"n_cols":14,"rows_kept":99,"cut":false,"hidden":false,"merged":[[2,1,2,7],[5,1,5,7],[6,1,6,7],[8,1,8,7],[9,1,9,7],[4,1,4,13],[7,1,7,13],[0,1,0,13],[1,1,1,13],[2,8,2,13],[12,0,13,0],[9,0,11,0],[11,1,11,13],[92,1,92,2],[92,5,92,8],[92,9,92,12],[93,1,93,2],[93,5,93,8],[93,9,93,12],[74,9,74,12],[74,5,74,8],[68,9,68,12],[70,5,70,8],[70,9,70,12],[59,5,59,8],[71,1,73,2],[71,4,73,4],[71,5,71,8],[71,9,71,12],[73,5,73,8],[73,9,73,12],[59,9,59,12],[61,5,61,8],[61,9,61,12],[94,1,94,2],[94,5,94,8],[94,9,94,12],[76,5,76,8],[76,9,76,12],[77,5,77,8],[77,9,77,12],[79,5,79,8],[79,9,79,12],[80,5,80,8],[80,9,80,12],[82,5,82,8],[82,9,82,12],[77,3,79,3],[80,3,82,3],[86,1,88,2],[80,4,82,4],[95,1,95,2],[95,5,95,8],[95,9,95,12],[97,1,97,4],[98,1,98,13],[86,9,86,12],[88,5,88,8],[88,9,88,12],[85,5,85,8],[85,9,85,12],[89,1,91,2],[89,4,91,4],[89,5,89,8],[89,9,89,12],[91,5,91,8],[91,9,91,12],[89,3,91,3],[86,4,88,4],[86,5,86,8],[86,3,88,3],[83,1,85,2],[83,4,85,4],[83,5,83,8],[83,9,83,12],[68,5,68,8],[65,5,65,8],[65,9,65,12],[67,5,67,8],[67,9,67,12],[65,3,67,3],[62,9,62,12],[64,5,64,8],[64,9,64,12],[62,5,62,8],[53,9,53,12],[55,5,55,8],[55,9,55,12],[50,5,50,8],[50,9,50,12],[52,5,52,8],[52,9,52,12],[56,9,56,12],[58,5,58,8],[58,9,58,12],[53,5,53,8],[56,5,56,8],[44,9,44,12],[46,5,46,8],[46,9,46,12],[47,1,49,2],[47,4,49,4],[47,5,47,8],[47,9,47,12],[49,5,49,8],[49,9,49,12],[44,5,44,8],[47,3,49,3],[35,9,35,12],[37,5,37,8],[37,9,37,12],[35,3,37,3],[40,9,40,12],[38,3,40,3],[38,9,38,12],[41,1,43,2],[41,4,43,4],[41,5,41,8],[41,9,41,12],[43,5,43,8],[43,9,43,12],[41,3,43,3],[35,5,35,8],[38,5,38,8],[40,5,40,8],[29,9,29,12],[31,5,31,8],[31,9,31,12],[32,1,34,2],[32,4,34,4],[32,5,32,8],[32,9,32,12],[34,5,34,8],[34,9,34,12],[32,3,34,3],[29,5,29,8],[29,1,31,2],[29,4,31,4],[26,1,28,2],[26,4,28,4],[26,5,26,8],[26,9,26,12],[28,5,28,8],[28,9,28,12],[23,3,25,3],[23,1,25,2],[23,4,25,4],[23,5,23,8],[26,3,28,3],[14,3,16,3],[17,3,19,3],[14,4,16,4],[14,5,14,8],[14,9,14,12],[16,5,16,8],[16,9,16,12],[23,9,23,12],[25,5,25,8],[25,9,25,12],[17,9,17,12],[19,5,19,8],[19,9,19,12],[20,1,22,2],[20,4,22,4],[20,5,20,8],[20,9,20,12],[22,5,22,8],[22,9,22,12],[20,3,22,3],[83,3,85,3],[53,4,55,4],[59,1,61,2],[59,4,61,4],[74,1,76,2],[77,1,79,2],[77,4,79,4],[80,1,82,2],[65,1,67,2],[68,3,70,3],[62,3,64,3],[68,1,70,2],[56,3,58,3],[65,4,67,4],[71,3,73,3],[74,3,76,3],[74,4,76,4],[56,1,58,2],[68,4,70,4],[44,3,46,3],[62,1,64,2],[62,4,64,4],[38,1,40,2],[38,4,40,4],[59,3,61,3],[44,1,46,2],[44,4,46,4],[53,1,55,2],[50,1,52,2],[50,4,52,4],[10,1,10,13],[9,8,9,13],[8,8,8,13],[3,8,3,13],[6,8,6,13],[5,8,5,13],[3,1,3,7],[56,4,58,4],[29,3,31,3],[35,1,37,2],[35,4,37,4],[50,3,52,3],[53,3,55,3],[12,13,13,13],[13,1,13,2],[13,5,13,8],[13,9,13,12],[12,3,13,3],[12,9,12,12],[14,1,16,2],[12,5,12,8],[17,1,19,2],[17,4,19,4],[17,5,17,8]]}
[]
[]
[null,"UNIDADE ESCOLAR",null,null,null,null,null,null,"PRAZO"]
[null,{"$f":"Orçamento!$O$4","v":"COLÉGIO ESTADUAL DA POLÍCIA MILITAR DE GOIÁS SILVIO DE CASTRO RIBEIRO - JARAGUÁ"},null,null,null,null,null,null,"60 DIAS CORRIDOS"]
[]
[null,"OBRA",null,null,null,null,null,null,"DATA"]
[null,{"$f":"Orçamento!$O$7","v":"REFORMA E AMPLIAÇÃO"},null,null,null,null,null,null,{"$f":"Orçamento!$S$7","v":"2020-03-31"}]
[]
[null,"LOCAL",null,null,null,null,null,null,"ÁREA TOTAL CONSTRUÍDA (M²)"]
["FILTRO",{"$f":"Orçamento!$V$7","v":"JARAGUÁ"},null,null,null,null,null,null,{"$f":"Orçamento!$S$13","v":2278.17}]
[]
[null,"CRONOGRAMA - FÍSICO FINANCEIRO"]
["↓","CUSTO TOTAL:",{"$f":"D93","v":0},"VALOR","Dias:",30,null,null,null,60,null,null,null,"TOTAL"]
[null,"DESCRIÇÃO DOS SERVIÇOS",null,null,"%","1ª PARCELA",null,null,null,"2ª PARCELA"]
[{"$f":"IF(D15>0,\"F\",\"\")","v":""},"SERVIÇOS PRELIMINARES",null,{"$f":"Orçamento!V342","v":0},{"$f":"Orçamento!X342","v":0},{"$f":"ROUND(F17*$D$15,2)","v":0},null,null,null,{"$f":"ROUND(J17*$D$15,2)","v":0},null,null,null,{"$f":"SUM(F15:M15)","v":0}]
{"$rows_left_out":85}
{"sheet":"Composição BDI","index":4,"n_rows":45,"n_cols":9,"rows_kept":45,"cut":false,"hidden":false,"merged":[[11,0,11,3],[12,0,12,3],[14,0,14,3],[15,0,15,3],[13,0,13,3],[0,0,0,3],[1,0,1,3],[4,0,4,3],[7,0,7,3],[10,0,10,3],[2,0,2,3],[3,0,3,3],[5,0,5,3],[6,0,6,3],[8,0,8,3],[9,0,9,3],[18,5,18,8],[17,0,17,3],[16,0,16,3],[44,0,44,3],[42,0,42,3],[43,0,43,3],[18,0,18,3],[36,0,36,3],[39,0,39,3],[38,0,38,3],[40,0,40,3],[29,0,29,2],[32,0,32,3],[33,0,33,3],[34,0,34,3],[35,0,35,3]]}
[]
[]
["UNIDADE ESCOLAR"]
[{"$f":"Orçamento!$O$4","v":"COLÉGIO ESTADUAL DA POLÍCIA MILITAR DE GOIÁS SILVIO DE CASTRO RIBEIRO - JARAGUÁ"}]
[]
["OBRA"]
[{"$f":"Orçamento!$O$7","v":"REFORMA E AMPLIAÇÃO"}]
[]
["ENDEREÇO"]
[{"$f":"Orçamento!$R$10","v":"RUA MARIA DA MATA RIOS S/N, CENTRO, CEP:76330-000"}]
[]
["CIDADE"]
[{"$f":"Orçamento!$V$7","v":"JARAGUÁ"}]
[]
["CRE"]
{"$rows_left_out":31}
{"sheet":"Relatório CENTRAL","index":5,"n_rows":40,"n_cols":5,"rows_kept":40,"cut":false,"hidden":false,"merged":[[8,3,8,4],[9,1,9,2],[10,1,10,4],[11,1,11,4],[39,1,39,2],[9,0,11,0],[0,1,0,4],[6,3,6,4],[9,3,9,4],[1,1,1,4],[2,1,2,2],[2,3,2,4],[3,1,3,2],[3,3,3,4],[4,1,4,4],[5,1,5,2],[5,3,5,4],[6,1,6,2],[7,1,7,4],[8,1,8,2]]}
[]
[]
[null,"UNIDADE ESCOLAR",null,"CIDADE"]
[null,{"$f":"Orçamento!$O$4","v":"COLÉGIO ESTADUAL DA POLÍCIA MILITAR DE GOIÁS SILVIO DE CASTRO RIBEIRO - JARAGUÁ"},null,{"$f":"Orçamento!$V$7","v":"JARAGUÁ"}]
[]
[null,"OBRA",null,"CRE"]
[null,{"$f":"Orçamento!$O$7","v":"REFORMA E AMPLIAÇÃO"},null,{"$f":"Orçamento!$O$10","v":"GOIANÉSIA"}]
[]
[null,"ENDEREÇO",null,"DATA"]
["FILTRO",{"$f":"Orçamento!$R$10","v":"RUA MARIA DA MATA RIOS S/N, CENTRO, CEP:76330-000"},null,{"$f":"Orçamento!$S$7","v":"2020-03-31"}]
[]
[null,"RELATÓRIO CENTRAL"]
["↓","CÓDIGO","ETAPA","PREÇO  (R$) C/ BDI","PARTIC  ( % )"]
[{"$f":"IF(D14>0,\"F\",\"\")","v":""},{"$f":"Orçamento!O342","v":"a."},{"$f":"Orçamento!P342","v":"SERVIÇOS PRELIMINARES"},{"$f":"Orçamento!V342","v":0},{"$f":"Orçamento!X342","v":0}]
[{"$f":"IF(D15>0,\"F\",\"\")","v":""},{"$f":"Orçamento!O343","v":"b."},{"$f":"Orçamento!P343","v":"TRANSPORTES"},{"$f":"Orçamento!V343","v":0},{"$f":"Orçamento!X343","v":0}]
{"$rows_left_out":26}
{"sheet":"Parc Maior Relev","index":6,"n_rows":21,"n_cols":7,"rows_kept":21,"cut":false,"hidden":false,"merged":[[0,1,0,6],[11,1,11,6],[1,1,1,6],[2,1,2,3],[2,4,2,6],[3,1,3,3],[3,4,3,6],[4,1,4,6],[5,1,5,3],[5,4,5,6],[9,1,9,3],[9,4,9,6],[10,1,10,6],[6,1,6,3],[6,4,6,6],[7,1,7,6],[10,0,12,0],[8,1,8,3],[8,4,8,6],[21,3,21,7],[19,1,19,6]]}
[]
[]
[null,"UNIDADE ESCOLAR",null,null,"CÓDIGO INEP"]
[null,{"$f":"Orçamento!$O$4","v":"COLÉGIO ESTADUAL DA POLÍCIA MILITAR DE GOIÁS SILVIO DE CASTRO RIBEIRO - JARAGUÁ"},null,null,{"$f":"Orçamento!$V$4","v":52024628}]
[]
[null,"OBRA",null,null,"CIDADE"]
[null,{"$f":"Orçamento!$O$7","v":"REFORMA E AMPLIAÇÃO"},null,null,{"$f":"Orçamento!$V$7","v":"JARAGUÁ"}]
[]
[null,"CRE",null,null,"ÁREA TOTAL CONSTRUÍDA (M²)"]
[null,{"$f":"Orçamento!$O$10","v":"GOIANÉSIA"},null,null,{"$f":"Orçamento!$S$13","v":2278.17}]
["FILTRO"]
[null,"PARCELA DE MAIOR RELEVÂNCIA"]
[null,"CÓDIGO","SERVIÇO","DESCRIÇÃO","UNID","QUANT","PARC. MAIOR RELEV (50%)"]
[{"$f":"IF(F14>0,\"F\",\"\")","v":"F"},"U.",{"$f":"IFERROR(VLOOKUP(B14,Orçamento!$O$342:$P$367,2,FALSE),\"(inserir código ao lado)\")","v":"REVESTIMENTO DE PISO"},"PISO DE CONCRETO DESEMPENADO","M²",168.7,{"$f":"F14*0.5","v":84.35}]
[{"$f":"IF(F15>0,\"F\",\"\")","v":""},null,{"$f":"IFERROR(VLOOKUP(B15,Orçamento!$O$342:$P$367,2,FALSE),\"(inserir código ao lado)\")","v":"(inserir código ao lado)"},null,{"$f":"IFERROR(VLOOKUP($D15,Orçamento!$R$20:$W$323,2,FALSE),\"-\")","v":"-"},{"$f":"SUMIF(Orçamento!$R$20:$R$323,'Parc Maior Relev'!D15,Orçamento!$T$20:$T$323)","v":0},0]
{"$rows_left_out":7}
{"sheet":"Composições","index":7,"n_rows":356,"n_cols":10,"rows_kept":356,"cut":false,"hidden":false,"merged":[[345,8,345,9],[351,1,351,7],[355,1,355,7],[339,1,339,7],[343,1,343,7],[345,0,346,0],[345,1,346,1],[345,2,346,2],[345,3,346,3],[345,4,346,4],[345,5,346,5],[345,6,345,7],[321,8,321,9],[327,1,327,7],[331,1,331,7],[333,0,334,0],[333,1,334,1],[333,2,334,2],[333,3,334,3],[333,4,334,4],[333,5,334,5],[333,6,333,7],[333,8,333,9],[315,1,315,7],[319,1,319,7],[321,0,322,0],[321,1,322,1],[321,2,322,2],[321,3,322,3],[321,4,322,4],[321,5,322,5],[321,6,321,7],[297,8,297,9],[303,1,303,7],[307,1,307,7],[309,0,310,0],[309,1,310,1],[309,2,310,2],[309,3,310,3],[309,4,310,4],[309,5,310,5],[309,6,309,7],[309,8,309,9],[291,1,291,7],[295,1,295,7],[297,0,298,0],[297,1,298,1],[297,2,298,2],[297,3,298,3],[297,4,298,4],[297,5,298,5],[297,6,297,7],[273,8,273,9],[279,1,279,7],[283,1,283,7],[285,0,286,0],[285,1,286,1],[285,2,286,2],[285,3,286,3],[285,4,286,4],[285,5,286,5],[285,6,285,7],[285,8,285,9],[267,1,267,7],[271,1,271,7],[273,0,274,0],[273,1,274,1],[273,2,274,2],[273,3,274,3],[273,4,274,4],[273,5,274,5],[273,6,273,7],[249,8,249,9],[255,1,255,7],[259,1,259,7],[261,0,262,0],[261,1,262,1],[261,2,262,2],[261,3,262,3],[261,4,262,4],[261,5,262,5],[261,6,261,7],[261,8,261,9],[243,1,243,7],[247,1,247,7],[249,0,250,0],[249,1,250,1],[249,2,250,2],[249,3,250,3],[249,4,250,4],[249,5,250,5],[249,6,249,7],[225,8,225,9],[231,1,231,7],[235,1,235,7],[237,0,238,0],[237,1,238,1],[237,2,238,2],[237,3,238,3],[237,4,238,4],[237,5,238,5],[237,6,237,7],[237,8,237,9],[219,1,219,7],[223,1,223,7],[225,0,226,0],[225,1,226,1],[225,2,226,2],[225,3,226,3],[225,4,226,4],[225,5,226,5],[225,6,225,7],[201,8,201,9],[207,1,207,7],[211,1,211,7],[213,0,214,0],[213,1,214,1],[213,2,214,2],[213,3,214,3],[213,4,214,4],[213,5,214,5],[213,6,213,7],[213,8,213,9],[196,1,196,7],[199,1,199,7],[201,0,202,0],[201,1,202,1],[201,2,202,2],[201,3,202,3],[201,4,202,4],[201,5,202,5],[201,6,201,7],[176,8,176,9],[182,1,182,7],[189,1,189,7],[191,0,192,0],[191,1,192,1],[191,2,192,2],[191,3,192,3],[191,4,192,4],[191,5,192,5],[191,6,191,7],[191,8,191,9],[170,1,170,7],[174,1,174,7],[176,0,177,0],[176,1,177,1],[176,2,177,2],[176,3,177,3],[176,4,177,4],[176,5,177,5],[176,6,176,7],[154,8,154,9],[160,1,160,7],[164,1,164,7],[166,0,167,0],[166,1,167,1],[166,2,167,2],[166,3,167,3],[166,4,167,4],[166,5,167,5],[166,6,166,7],[166,8,166,9],[148,1,148,7],[152,1,152,7],[154,0,155,0],[154,1,155,1],[154,2,155,2],[154,3,155,3],[154,4,155,4],[154,5,155,5],[154,6,154,7],[142,8,142,9],[124,1,124,7],[128,1,128,7],[130,0,131,0],[130,1,131,1],[130,2,131,2],[130,3,131,3],[130,4,131,4],[130,5,131,5],[130,6,130,7],[130,8,130,9],[136,1,136,7],[140,1,140,7],[142,0,143,0],[142,1,143,1],[142,2,143,2],[142,3,143,3],[142,4,143,4],[142,5,143,5],[142,6,142,7],[96,3,97,3],[96,4,97,4],[96,5,97,5],[96,6,96,7],[118,8,118,9],[101,1,101,7],[104,1,104,7],[106,0,107,0],[106,1,107,1],[106,2,107,2],[106,3,107,3],[106,4,107,4],[106,5,107,5],[106,6,106,7],[106,8,106,9],[112,1,112,7],[116,1,116,7],[118,0,119,0],[118,1,119,1],[118,2,119,2],[118,3,119,3],[118,4,119,4],[118,5,119,5],[118,6,118,7],[96,8,96,9],[76,5,77,5],[76,6,76,7],[76,8,76,9],[76,0,77,0],[76,1,77,1],[76,2,77,2],[76,3,77,3],[76,4,77,4],[81,1,81,7],[84,1,84,7],[86,0,87,0],[86,1,87,1],[86,2,87,2],[86,3,87,3],[86,4,87,4],[86,5,87,5],[86,6,86,7],[86,8,86,9],[94,1,94,7],[91,1,91,7],[96,0,97,0],[96,1,97,1],[96,2,97,2],[64,5,65,5],[64,6,64,7],[64,8,64,9],[70,1,70,7],[74,1,74,7],[64,0,65,0],[64,1,65,1],[64,2,65,2],[64,3,65,3],[64,4,65,4],[52,5,53,5],[52,6,52,7],[52,8,52,9],[58,1,58,7],[62,1,62,7],[52,0,53,0],[52,1,53,1],[52,2,53,2],[52,3,53,3],[52,4,53,4],[40,5,41,5],[40,6,40,7],[40,8,40,9],[46,1,46,7],[50,1,50,7],[40,0,41,0],[40,1,41,1],[40,2,41,2],[40,3,41,3],[40,4,41,4],[28,5,29,5],[28,6,28,7],[28,8,28,9],[34,1,34,7],[38,1,38,7],[28,0,29,0],[28,1,29,1],[28,2,29,2],[28,3,29,3],[28,4,29,4],[16,5,17,5],[16,6,16,7],[16,8,16,9],[22,1,22,7],[26,1,26,7],[16,0,17,0],[16,1,17,1],[16,2,17,2],[16,3,17,3],[16,4,17,4],[15,0,15,9],[13,0,13,2],[13,3,13,6],[1,0,1,9],[3,7,3,9],[4,7,4,9],[6,7,6,9],[7,7,7,9],[6,0,6,6],[10,8,10,9],[13,8,13,9],[14,0,14,9],[8,0,8,9],[5,0,5,9],[2,0,2,9],[0,0,0,8],[10,0,10,2],[10,3,10,6],[11,0,11,9],[12,0,12,2],[12,3,12,6],[12,7,12,8],[7,0,7,6],[9,0,9,2],[9,3,9,6],[9,7,9,8],[3,0,3,6],[4,0,4,6]]}
[]
[]
[]
["UNIDADE ESCOLAR",null,null,null,null,null,null,"CÓDIGO INEP"]
[{"$f":"Orçamento!$O$4","v":"COLÉGIO ESTADUAL DA POLÍCIA MILITAR DE GOIÁS SILVIO DE CASTRO RIBEIRO - JARAGUÁ"},null,null,null,null,null,null,{"$f":"Orçamento!$V$4","v":52024628}]
[]
["OBRA",null,null,null,null,null,null,"CIDADE"]
[{"$f":"Orçamento!$O$7","v":"REFORMA E AMPLIAÇÃO"},null,null,null,null,null,null,{"$f":"Orçamento!$V$7","v":"JARAGUÁ"}]
[]
["CRE",null,null,"ENDEREÇO",null,null,null,"REFERÊNCIA AGETOP"]
[{"$f":"Orçamento!$O$10","v":"GOIANÉSIA"},null,null,{"$f":"Orçamento!$R$10","v":"RUA MARIA DA MATA RIOS S/N, CENTRO, CEP:76330-000"},null,null,null,{"$f":"Orçamento!$V$10","v":"DEZ/18"},{"$f":"Orçamento!$W$10","v":"ONERADA"}]
[]
["DATA",null,null,"ÁREA TOTAL CONSTRUÍDA (M²)",null,null,null,"REFERÊNCIA SINAPI"]
[{"$f":"Orçamento!$S$7","v":"2020-03-31"},null,null,{"$f":"Orçamento!$S$13","v":2278.17},null,null,null,{"$f":"Orçamento!$V$13","v":"MAR/19"},{"$f":"Orçamento!$W$13","v":"ONERADA"}]
[]
{"$rows_left_out":341}