{"text_format":"1","workbook":"xlsx","n_sheets":9,"sheets":["Orçamento","Resumo ","Somatório","Cronog_60_Dias","Composição BDI","Relatório CENTRAL","Parc Maior Relev","Composições","Cotações"],"not_rendered":{"charts":0,"images":3,"macros":1,"external_links":0,"defined_names":82,"comments":3,"pivot_tables":0},"unopened":[],"bounds":{"document_bytes":16777216,"sheet_cells":100000,"rows_first":2000,"rows_last":500,"rows_between":2000,"halvings":0,"cell_chars":16384,"cell_head_chars":4096},"cells_cut":0,"cells_raw":0,"read":"whole","date_system":"1900"}

{"sheet":"Orçamento","index":0,"n_rows":651,"n_cols":24,"rows_kept":651,"cut":false,"hidden":false,"merged":[[586,16,586,22],[8,12,9,12],[621,18,621,20],[621,21,621,22],[0,14,0,22],[8,14,8,16],[9,14,9,16],[11,14,11,16],[12,14,12,16],[14,14,14,22],[1,14,1,22],[4,14,4,22],[7,14,7,22],[605,18,605,20],[605,21,605,22],[613,21,613,22],[602,15,602,17],[603,15,603,17],[604,15,604,17],[606,21,606,22],[614,18,614,20],[614,21,614,22],[612,18,612,20],[612,21,612,22],[620,18,620,20],[620,21,620,22],[607,18,607,20],[607,21,607,22],[600,18,600,20],[600,21,600,22],[622,18,622,20],[622,21,622,22],[576,20,576,21],[598,18,598,20],[598,21,598,22],[599,18,599,20],[599,21,599,22],[597,18,597,20],[597,21,597,22],[606,18,606,20],[577,20,577,21],[588,18,588,22],[594,18,594,20],[594,21,594,22],[595,18,595,20],[595,21,595,22],[596,18,596,20],[596,21,596,22],[619,18,619,20],[619,21,619,22],[616,21,616,22],[617,18,617,20],[617,21,617,22],[618,18,618,20],[618,21,618,22],[608,18,608,20],[608,21,608,22],[615,18,615,20],[615,21,615,22],[610,21,610,22],[611,18,611,20],[611,21,611,22],[613,18,613,20],[609,18,609,20],[609,21,609,22],[610,18,610,20],[614,15,614,17],[615,15,615,17],[616,15,616,17],[617,15,617,17],[618,15,618,17],[591,14,591,23],[580,20,580,21],[579,20,579,21],[575,17,580,17],[575,20,575,21],[592,18,592,20],[592,21,592,22],[593,18,593,20],[593,21,593,22],[581,20,581,21],[601,18,601,20],[601,21,601,22],[602,18,602,20],[602,21,602,22],[603,18,603,20],[603,21,603,22],[604,18,604,20],[604,21,604,22],[616,18,616,20],[593,15,593,17],[594,15,594,17],[595,15,595,17],[596,15,596,17],[597,15,597,17],[598,15,598,17],[599,15,599,17],[600,15,600,17],[601,15,601,17],[605,15,605,17],[606,15,606,17],[607,15,607,17],[608,15,608,17],[609,15,609,17],[610,15,610,17],[611,15,611,17],[612,15,612,17],[613,15,613,17],[583,16,583,22],[584,16,584,22],[585,16,585,22],[3,21,3,22],[2,21,2,22],[5,21,5,22],[10,14,10,23],[13,14,13,23],[6,21,6,22],[9,17,9,20],[2,14,2,20],[3,14,3,20],[5,18,5,20],[6,18,6,20],[11,18,11,20],[12,18,12,20],[6,14,6,17],[5,14,5,17],[587,16,587,22],[650,18,650,20],[650,21,650,22],[647,14,647,17],[644,15,644,17],[644,18,644,20],[644,21,644,22],[645,15,645,17],[645,18,645,20],[645,21,645,22],[646,15,646,17],[646,18,646,20],[646,21,646,22],[649,18,649,20],[649,21,649,22],[648,18,648,20],[648,21,648,22],[625,14,625,23],[626,18,626,20],[626,21,626,22],[627,15,627,17],[627,18,627,20],[627,21,627,22],[628,15,628,17],[619,14,619,17],[626,15,626,17],[592,15,592,17],[647,18,647,20],[647,21,647,22],[635,15,635,17],[635,18,635,20],[635,21,635,22],[636,15,636,17],[636,18,636,20],[636,21,636,22],[637,15,637,17],[637,18,637,20],[637,21,637,22],[641,15,641,17],[641,18,641,20],[641,21,641,22],[642,15,642,17],[642,18,642,20],[642,21,642,22],[643,15,643,17],[632,15,632,17],[628,18,628,20],[628,21,628,22],[643,18,643,20],[643,21,643,22],[638,15,638,17],[638,18,638,20],[638,21,638,22],[639,15,639,17],[639,18,639,20],[639,21,639,22],[640,15,640,17],[640,18,640,20],[640,21,640,22],[632,18,632,20],[632,21,632,22],[633,15,633,17],[633,18,633,20],[633,21,633,22],[634,15,634,17],[634,18,634,20],[634,21,634,22],[629,15,629,17],[629,18,629,20],[629,21,629,22],[630,15,630,17],[630,18,630,20],[630,21,630,22],[631,15,631,17],[631,18,631,20],[631,21,631,22]]}
[]
[]
[null,null,null,null,null,null,null,null,null,null,null,null,null,null,"UNIDADE ESCOLAR",null,null,null,null,null,null,"CÓDIGO INEP"]
[null,null,null,null,null,null,null,null,null,null,null,null,null,null,"COLÉGIO ESTADUAL ELVIRA LEÃO BARRETO",null,null,null,null,null,null,52042910]
[]
["Nmax",null,null,null,null,null,null,null,null,null,null,null,null,null,"OBRA",null,null,null,"DATA",null,null,"CIDADE"]
[{"$f":"MAX($C$18:$C$575)","v":4},null,null,null,null,null,null,null,null,null,null,null,null,null,"REFORMA",null,null,null,"2020-05-12",null,null,"SIMOLÂNDIA"]
[]
[null,null,null,null,null,null,null,null,null,null,null,null,"",null,"CRE",null,null,"ENDEREÇO",null,null,null,"REFERÊNCIA AGETOP"]
[null,null,null,null,null,null,null,null,null,null,null,null,null,null,"POSSE",null,null,"R HUMBERTO ALENCAR CASTELO BRANCO S/N, CENTRO, CEP:73930-000",null,null,null,"DEZ/18","DESONERADA"]
[]
[null,null,null,null,null,null,null,null,null,null,null,null,null,null,"ÁREA EXISTENTE (M²)",null,null,"ÁREA A CONSTRUIR (M²)","ÁREA TOTAL CONSTRUÍDA (M²)",null,null,"REFERÊNCIA SINAPI"]
[null,null,null,null,null,null,null,null,null,null,null,null,null,null,1086.18,null,null,181.5,1267.68,null,null,"MAR/19","DESONERADA"]
[]
[null,null,null,null,null,null,null,null,null,null,null,"FILTRO",null,null,"PLANILHA ORÇAMENTÁRIA"]
["Nível E","Save Nivel","Nível C","Altura","n1","n2","n3","n4","n5","Czero","Cnível","↓","Nível","Nível Corrigido","ITEM","TABELA","CODIGO","DESCRIÇÃO DOS SERVIÇOS","UNID","QUANT","MAT","MO","T.SERVIÇO","OBSERVAÇÕES¹"]
[{"$f":"CHOOSE(1+LOG(1+2*(ORÇAMENTO.Nivel=\"Nível 1\")+4*(ORÇAMENTO.Nivel=\"Nível 2\")+8*(ORÇAMENTO.Nivel=\"Nível 3\")+16*(ORÇAMENTO.Nivel=\"Nível 4\")+32*(ORÇAMENTO.Nivel=\"Serviço\"),2),0,1,2,3,4,\"S\")","v":"S"},{"$f":"IF(OR(C17=\"s\",C17=0),OFFSET(B17,-1,0),C17)","v":"Save Nivel"},{"$f":"IF(OFFSET(C17,-1,0)=\"L\",1,IF(OFFSET(C17,-1,0)=1,2,IF(OR(A17=\"s\",A17=0),\"S\",IF(AND(OFFSET(C17,-1,0)=2,A17=4),3,IF(AND(OR(OFFSET(C17,-1,0)=\"s\",OFFSET(C17,-1,0)=0),A17<>\"s\",A17>OFFSET(B17,-1,0)),OFFSET(B17,-1,0),A17)))))","v":"S"},{"$f":"IF(OR(C17=\"S\",C17=0),0,IF(ISERROR(K17),J17,SMALL(J17:K17,1)))","v":0},{"$f":"IF($C17=1,OFFSET(E17,-1,0)+1,OFFSET(E17,-1,0))","v":"n1"},{"$f":"IF($C17=1,0,IF($C17=2,OFFSET(F17,-1,0)+1,OFFSET(F17,-1,0)))","v":"n2"},{"$f":"IF(AND($C17<=2,$C17<>0),0,IF($C17=3,OFFSET(G17,-1,0)+1,OFFSET(G17,-1,0)))","v":"n3"},{"$f":"IF(AND($C17<=3,$C17<>0),0,IF($C17=4,OFFSET(H17,-1,0)+1,OFFSET(H17,-1,0)))","v":"n4"},{"$f":"IF(AND($C17<=4,$C17<>0),0,IF(AND($C17=\"S\",$W17>0),OFFSET(I17,-1,0)+1,OFFSET(I17,-1,0)))","v":"n5"},{"$f":"IF(OR($C17=\"S\",$C17=0),0,MATCH(0,OFFSET($D17,1,$C17,ROW($C$575)-ROW($C17)),0))","v":0},{"$f":"IF(OR($C17=\"S\",$C17=0),0,MATCH(OFFSET($D17,0,$C17)+1,OFFSET($D17,1,$C17,ROW($C$575)-ROW($C17)),0))","v":0},"","Serviço","Serviço","-","SINAPI",null,"(sem código)","-",null,0,0,0,""]
[0,null,"L",{"$f":"COUNTA(OFFSET(D18,1,0):D$575)","v":556},{"$f":"LEFT(O19,1)-1","v":0},null,null,null,null,null,null,"F","LOTE","LOTE","REFORMA - COLÉGIO ESTADUAL ELVIRA LEÃO BARRETO",null,null,null,null,null,null,null,361127.71]
[1,{"$f":"IF(OR(C19=\"s\",C19=0),OFFSET(B19,-1,0),C19)","v":1},{"$f":"IF(OFFSET(C19,-1,0)=\"L\",1,IF(OFFSET(C19,-1,0)=1,2,IF(OR(A19=\"s\",A19=0),\"S\",IF(AND(OFFSET(C19,-1,0)=2,A19=4),3,IF(AND(OR(OFFSET(C19,-1,0)=\"s\",OFFSET(C19,-1,0)=0),A19<>\"s\",A19>OFFSET(B19,-1,0)),OFFSET(B19,-1,0),A19)))))","v":1},{"$f":"IF(OR(C19=\"S\",C19=0),0,IF(ISERROR(K19),J19,SMALL(J19:K19,1)))","v":185},{"$f":"IF($C19=1,OFFSET(E19,-1,0)+1,OFFSET(E19,-1,0))","v":1},{"$f":"IF($C19=1,0,IF($C19=2,OFFSET(F19,-1,0)+1,OFFSET(F19,-1,0)))","v":0},{"$f":"IF(AND($C19<=2,$C19<>0),0,IF($C19=3,OFFSET(G19,-1,0)+1,OFFSET(G19,-1,0)))","v":0},{"$f":"IF(AND($C19<=3,$C19<>0),0,IF($C19=4,OFFSET(H19,-1,0)+1,OFFSET(H19,-1,0)))","v":0},0,{"$f":"IF(OR($C19=\"S\",$C19=0),0,MATCH(0,OFFSET($D19,1,$C19,ROW($C$575)-ROW($C19)),0))","v":556},{"$f":"IF(OR($C19=\"S\",$C19=0),0,MATCH(OFFSET($D19,0,$C19)+1,OFFSET($D19,1,$C19,ROW($C$575)-ROW($C19)),0))","v":185},"F","Nível 1","Nível 1","1.","AGETOP",null,"REFORMA"]
[2,{"$f":"IF(OR(C20=\"s\",C20=0),OFFSET(B20,-1,0),C20)","v":2},{"$f":"IF(OFFSET(C20,-1,0)=\"L\",1,IF(OFFSET(C20,-1,0)=1,2,IF(OR(A20=\"s\",A20=0),\"S\",IF(AND(OFFSET(C20,-1,0)=2,A20=4),3,IF(AND(OR(OFFSET(C20,-1,0)=\"s\",OFFSET(C20,-1,0)=0),A20<>\"s\",A20>OFFSET(B20,-1,0)),OFFSET(B20,-1,0),A20)))))","v":2},{"$f":"IF(OR(C20=\"S\",C20=0),0,IF(ISERROR(K20),J20,SMALL(J20:K20,1)))","v":13},{"$f":"IF($C20=1,OFFSET(E20,-1,0)+1,OFFSET(E20,-1,0))","v":1},{"$f":"IF($C20=1,0,IF($C20=2,OFFSET(F20,-1,0)+1,OFFSET(F20,-1,0)))","v":1},{"$f":"IF(AND($C20<=2,$C20<>0),0,IF($C20=3,OFFSET(G20,-1,0)+1,OFFSET(G20,-1,0)))","v":0},{"$f":"IF(AND($C20<=3,$C20<>0),0,IF($C20=4,OFFSET(H20,-1,0)+1,OFFSET(H20,-1,0)))","v":0},0,184,13,"F","Nível 2","Nível 2","1.1.","AGETOP",null,"SERVIÇOS PRELIMINARES"]
[3,3,3,2,1,1,1,0,0,12,2,"F","Nível 3","Nível 3","1.1.1.","SINAPI",null,"FORRO PVC SEM ESTRUTURA","-",null,null,null,null,""]
["S",3,"S",0,1,1,1,0,0,0,0,"F","Serviço","Serviço","1.1.1.0.1.","SINAPI",97640,"REMOÇÃO DE FORROS DE DRYWALL, PVC E FIBROMINERAL, DE FORMA MANUAL, SEM REAPROVEITAMENTO. AF_12/2017","M2",296,null,null,null,""]
[3,{"$f":"IF(OR(C23=\"s\",C23=0),OFFSET(B23,-1,0),C23)","v":3},{"$f":"IF(OFFSET(C23,-1,0)=\"L\",1,IF(OFFSET(C23,-1,0)=1,2,IF(OR(A23=\"s\",A23=0),\"S\",IF(AND(OFFSET(C23,-1,0)=2,A23=4),3,IF(AND(OR(OFFSET(C23,-1,0)=\"s\",OFFSET(C23,-1,0)=0),A23<>\"s\",A23>OFFSET(B23,-1,0)),OFFSET(B23,-1,0),A23)))))","v":3},{"$f":"IF(OR(C23=\"S\",C23=0),0,IF(ISERROR(K23),J23,SMALL(J23:K23,1)))","v":10},1,1,2,0,0,10,124,"F","Nível 3","Nível 3","1.1.2.","SINAPI",null,"OUTROS","-",null,null,null,null,""]
["S",3,"S",0,1,1,2,0,0,0,0,"F","Serviço","Serviço","1.1.2.0.1.","AGETOP",20101,"DEMOLICAO COBERTURA TELHA CERAMICA C/ TRANSP. ATÉ CB. E CARGA","m2    ",400,null,null,null,""]
["S",3,"S",0,1,1,2,0,0,0,0,"F","Serviço","Serviço","1.1.2.0.2.","AGETOP",20104,"DEMOLIÇÃO DE RIPAS C/ TRANSP. ATÉ CB. E CARGA","m2    ",200,null,null,null,""]
["S",3,"S",0,1,1,2,0,0,0,0,"F","Serviço","Serviço","1.1.2.0.3.","AGETOP",20109,"DEM.PISO CIMENT.SOBRE LASTRO CONC.C/TR.ATE CB. E CARGA","m2    ",296,null,null,null,""]
["S",3,"S",0,1,1,2,0,0,0,0,"F","Serviço","Serviço","1.1.2.0.4.","AGETOP",20121,"DEM. MANUAL EM CONCR.SIMPLES C/TR.ATE CB.E CARGA (O.C.)","m3    ",3,null,null,null,""]
["S",3,"S",0,1,1,2,0,0,0,0,"F","Serviço","Serviço","1.1.2.0.5.","SINAPI",97622,"DEMOLIÇÃO DE ALVENARIA DE BLOCO FURADO, DE FORMA MANUAL, SEM REAPROVEITAMENTO. AF_12/2017","M3",13,null,null,null,"Referência: AGETOP - 20118"]
["S",3,"S",0,1,1,2,0,0,0,0,"F","Serviço","Serviço","1.1.2.0.6.","AGETOP",20162,"DEMOLIÇÃO DAS INSTALAÇÕES ELÉTRICAS E AFINS C/ TRANSP. ATÉ CB. E CARGA","H     ",16,null,null,null,""]
["S",3,"S",0,1,1,2,0,0,0,0,"F","Serviço","Serviço","1.1.2.0.7.","AGETOP",20163,"DEMOLIÇÃO DAS INSTALAÇÕES HIDROSANITÁRIAS E AFINS C/ TRANSP. ATÉ CB. E CARGA","H     ",8,null,null,null,""]
["S",3,"S",0,1,1,2,0,0,0,0,"F","Serviço","Serviço","1.1.2.0.8.","AGETOP",72080,"POSTE/TRAFO - CAMINHÃO MUNCK 12 TON. (MÍNIMO 4H/DIA)","H     ",4,null,null,null,""]
["S",3,"S",0,1,1,2,0,0,0,0,"F","Serviço","Serviço","1.1.2.0.9.","SINAPI","74209/1","PLACA DE OBRA EM CHAPA DE ACO GALVANIZADO","M2",4.5,null,null,null,"Referência: AGETOP - 21301"]
[2,2,2,3,1,2,0,0,0,171,3,"F","Nível 2","Nível 2","1.2.","AGETOP",null,"TRANSPORTES","-",null,null,null,null,""]
["S",2,"S",0,1,2,0,0,0,0,0,"F","Serviço","Serviço","1.2.0.0.1.","SINAPI",72900,"TRANSPORTE DE ENTULHO COM CAMINHAO BASCULANTE 6 M3, RODOVIA PAVIMENTADA, DMT 0,5 A 1,0 KM","M3",84,null,null,null,""]
["S",2,"S",0,1,2,0,0,0,0,0,"F","Serviço","Serviço","1.2.0.0.2.","SINAPI",72897,"CARGA MANUAL DE ENTULHO EM CAMINHAO BASCULANTE 6 M3","M3",84,null,null,null,""]
[2,2,2,7,1,3,0,0,0,168,7,"F","Nível 2","Nível 2","1.3.","AGETOP",null,"SERVIÇO EM TERRA","-",null,null,null,null,""]
[3,3,3,3,1,3,1,0,0,6,3,"F","Nível 3","Nível 3","1.3.1.","SINAPI",null,"ELETRICO","-",null,null,null,null,""]
[{"$f":"CHOOSE(1+LOG(1+2*(ORÇAMENTO.Nivel=\"Nível 1\")+4*(ORÇAMENTO.Nivel=\"Nível 2\")+8*(ORÇAMENTO.Nivel=\"Nível 3\")+16*(ORÇAMENTO.Nivel=\"Nível 4\")+32*(ORÇAMENTO.Nivel=\"Serviço\"),2),0,1,2,3,4,\"S\")","v":"S"},3,"S",0,1,3,1,0,{"$f":"IF(AND($C38<=4,$C38<>0),0,IF(AND($C38=\"S\",$W38>0),OFFSET(I38,-1,0)+1,OFFSET(I38,-1,0)))","v":0},0,0,"F","Serviço","Serviço","1.3.1.0.1.","SINAPI",93358,"ESCAVAÇÃO MANUAL DE VALA COM PROFUNDIDADE MENOR OU IGUAL A 1,30 M. AF_03/2016","M3",2.7,null,null,null,"Referência: AGETOP - 40101"]
["S",3,"S",0,1,3,1,0,0,0,0,"F","Serviço","Serviço","1.3.1.0.2.","SINAPI",96995,"REATERRO MANUAL APILOADO COM SOQUETE. AF_10/2017","M3",2.7,null,null,null,"Referência: AGETOP - 40902"]
[3,3,3,3,{"$f":"IF($C40=1,OFFSET(E40,-1,0)+1,OFFSET(E40,-1,0))","v":1},{"$f":"IF($C40=1,0,IF($C40=2,OFFSET(F40,-1,0)+1,OFFSET(F40,-1,0)))","v":3},{"$f":"IF(AND($C40<=2,$C40<>0),0,IF($C40=3,OFFSET(G40,-1,0)+1,OFFSET(G40,-1,0)))","v":2},{"$f":"IF(AND($C40<=3,$C40<>0),0,IF($C40=4,OFFSET(H40,-1,0)+1,OFFSET(H40,-1,0)))","v":0},0,3,107,"F","Nível 3","Nível 3","1.3.2.","SINAPI",null,"CENTRAL DE GAS","-",null,null,null,null,""]
["S",3,"S",0,1,3,2,0,0,0,0,"F","Serviço","Serviço","1.3.2.0.1.","SINAPI",93358,"ESCAVAÇÃO MANUAL DE VALA COM PROFUNDIDADE MENOR OU IGUAL A 1,30 M. AF_03/2016","M3",1.4,null,null,null,"Referência: AGETOP - 40101"]
["S",3,"S",0,1,3,2,0,0,0,0,"F","Serviço","Serviço","1.3.2.0.2.","SINAPI",96995,"REATERRO MANUAL APILOADO COM SOQUETE. AF_10/2017","M3",1.1200000000000001,null,null,null,"Referência: AGETOP - 40902"]
[{"$f":"CHOOSE(1+LOG(1+2*(ORÇAMENTO.Nivel=\"Nível 1\")+4*(ORÇAMENTO.Nivel=\"Nível 2\")+8*(ORÇAMENTO.Nivel=\"Nível 3\")+16*(ORÇAMENTO.Nivel=\"Nível 4\")+32*(ORÇAMENTO.Nivel=\"Serviço\"),2),0,1,2,3,4,\"S\")","v":2},{"$f":"IF(OR(C43=\"s\",C43=0),OFFSET(B43,-1,0),C43)","v":2},{"$f":"IF(OFFSET(C43,-1,0)=\"L\",1,IF(OFFSET(C43,-1,0)=1,2,IF(OR(A43=\"s\",A43=0),\"S\",IF(AND(OFFSET(C43,-1,0)=2,A43=4),3,IF(AND(OR(OFFSET(C43,-1,0)=\"s\",OFFSET(C43,-1,0)=0),A43<>\"s\",A43>OFFSET(B43,-1,0)),OFFSET(B43,-1,0),A43)))))","v":2},{"$f":"IF(OR(C43=\"S\",C43=0),0,IF(ISERROR(K43),J43,SMALL(J43:K43,1)))","v":53},{"$f":"IF($C43=1,OFFSET(E43,-1,0)+1,OFFSET(E43,-1,0))","v":1},{"$f":"IF($C43=1,0,IF($C43=2,OFFSET(F43,-1,0)+1,OFFSET(F43,-1,0)))","v":4},{"$f":"IF(AND($C43<=2,$C43<>0),0,IF($C43=3,OFFSET(G43,-1,0)+1,OFFSET(G43,-1,0)))","v":0},{"$f":"IF(AND($C43<=3,$C43<>0),0,IF($C43=4,OFFSET(H43,-1,0)+1,OFFSET(H43,-1,0)))","v":0},{"$f":"IF(AND($C43<=4,$C43<>0),0,IF(AND($C43=\"S\",$W43>0),OFFSET(I43,-1,0)+1,OFFSET(I43,-1,0)))","v":0},161,53,"F","Nível 2","Nível 2","1.4.",null,null,"INSTALAÇÕES ELÉTRICAS","-",null,null,null,null,""]
["S",2,"S",0,1,4,0,0,0,0,0,"F","Serviço","Serviço","1.4.0.0.1.","SINAPI",97661,"REMOÇÃO DE CABOS ELÉTRICOS, DE FORMA MANUAL, SEM REAPROVEITAMENTO. AF_12/2017","M",4000,null,null,null,""]
["S",2,"S",0,1,4,0,0,0,0,0,"F","Serviço","Serviço","1.4.0.0.2.","SINAPI",97660,"REMOÇÃO DE INTERRUPTORES/TOMADAS ELÉTRICAS, DE FORMA MANUAL, SEM REAPROVEITAMENTO. AF_12/2017","UN",45,null,null,null,""]
["S",2,"S",0,1,4,0,0,0,0,0,"F","Serviço","Serviço","1.4.0.0.3.","SINAPI",97665,"REMOÇÃO DE LUMINÁRIAS, DE FORMA MANUAL, SEM REAPROVEITAMENTO. AF_12/2017","UN",30,null,null,null,""]
["S",2,"S",0,1,4,0,0,0,0,0,"F","Serviço","Serviço","1.4.0.0.4.","AGETOP",70351,"BRACADEIRA METALICA TIPO \"U\" DIAM. 3/4\"","Un    ",30,null,null,null,""]
["S",2,"S",0,1,4,0,0,0,0,0,"F","Serviço","Serviço","1.4.0.0.5.","AGETOP",70352,"BRACADEIRA METALICA TIPO \"U\" DIAM. 1\"","Un    ",20,null,null,null,""]
["S",2,"S",0,1,4,0,0,0,0,0,"F","Serviço","Serviço","1.4.0.0.6.","AGETOP",70353,"BRACADEIRA METALICA TIPO \"U\" DIAM. 1.1/4\"","Un    ",10,null,null,null,""]
["S",2,"S",0,1,4,0,0,0,0,0,"F","Serviço","Serviço","1.4.0.0.7.","AGETOP",70354,"BRACADEIRA METALICA TIPO \"U\" DIAM. 1.1/2\"","Un    ",10,null,null,null,""]
["S",2,"S",0,1,4,0,0,0,0,0,"F","Serviço","Serviço","1.4.0.0.8.","AGETOP",70355,"BRACADEIRA METALICA TIPO \"U\" DIAM. 2\"","Un    ",10,null,null,null,""]
["S",2,"S",0,1,4,0,0,0,0,0,"F","Serviço","Serviço","1.4.0.0.9.","AGETOP",70421,"BUCHA E ARRUELA METALICA DIAM. 3/4\"","PR    ",30,null,null,null,""]
["S",2,"S",0,1,4,0,0,0,0,0,"F","Serviço","Serviço","1.4.0.0.10.","AGETOP",70422,"BUCHA E ARRUELA METALICA DIAM. 1\"","PR    ",20,null,null,null,""]
["S",2,"S",0,1,4,0,0,0,0,0,"F","Serviço","Serviço","1.4.0.0.11.","AGETOP",70423,"BUCHA E ARRUELA METALICA DIAM. 1.1/4\"","PR    ",10,null,null,null,""]
["S",2,"S",0,1,4,0,0,0,0,0,"F","Serviço","Serviço","1.4.0.0.12.","AGETOP",70424,"BUCHA E ARRUELA METALICA DIAM. 1.1/2\"","PR    ",10,null,null,null,""]
["S",2,"S",0,1,4,0,0,0,0,0,"F","Serviço","Serviço","1.4.0.0.13.","AGETOP",70425,"BUCHA E ARRUELA METALICA DIAM. 2\"","PR    ",10,null,null,null,""]
["S",2,"S",0,1,4,0,0,0,0,0,"F","Serviço","Serviço","1.4.0.0.14.","SINAPI",92980,"CABO DE COBRE FLEXÍVEL ISOLADO, 10 MM², ANTI-CHAMA 0,6/1,0 KV, PARA DISTRIBUIÇÃO - FORNECIMENTO E INSTALAÇÃO. AF_12/2015","M",50,null,null,null,""]
["S",2,"S",0,1,4,0,0,0,0,0,"F","Serviço","Serviço","1.4.0.0.15.","SINAPI",92982,"CABO DE COBRE FLEXÍVEL ISOLADO, 16 MM², ANTI-CHAMA 0,6/1,0 KV, PARA DISTRIBUIÇÃO - FORNECIMENTO E INSTALAÇÃO. AF_12/2015","M",15,null,null,null,""]
["S",2,"S",0,1,4,0,0,0,0,0,"F","Serviço","Serviço","1.4.0.0.16.","SINAPI",92984,"CABO DE COBRE FLEXÍVEL ISOLADO, 25 MM², ANTI-CHAMA 0,6/1,0 KV, PARA DISTRIBUIÇÃO - FORNECIMENTO E INSTALAÇÃO. AF_12/2015","M",60,null,null,null,"Referência: AGETOP - 70511"]
["S",2,"S",0,1,4,0,0,0,0,0,"F","Serviço","Serviço","1.4.0.0.17.","SINAPI",96971,"CORDOALHA DE COBRE NU 16 MM², NÃO ENTERRADA, COM ISOLADOR - FORNECIMENTO E INSTALAÇÃO. AF_12/2017","M",45,null,null,null,"Referência: AGETOP - 70541"]
[{"$f":"CHOOSE(1+LOG(1+2*(ORÇAMENTO.Nivel=\"Nível 1\")+4*(ORÇAMENTO.Nivel=\"Nível 2\")+8*(ORÇAMENTO.Nivel=\"Nível 3\")+16*(ORÇAMENTO.Nivel=\"Nível 4\")+32*(ORÇAMENTO.Nivel=\"Serviço\"),2),0,1,2,3,4,\"S\")","v":"S"},2,"S",0,1,4,0,0,{"$f":"IF(AND($C61<=4,$C61<>0),0,IF(AND($C61=\"S\",$W61>0),OFFSET(I61,-1,0)+1,OFFSET(I61,-1,0)))","v":0},0,0,"F","Serviço","Serviço","1.4.0.0.18.","SINAPI",91927,"CABO DE COBRE FLEXÍVEL ISOLADO, 2,5 MM², ANTI-CHAMA 0,6/1,0 KV, PARA CIRCUITOS TERMINAIS - FORNECIMENTO E INSTALAÇÃO. AF_12/2015","M",4000,null,null,null,"Referência: AGETOP - 70581"]
["S",2,"S",0,1,4,0,0,0,0,0,"F","Serviço","Serviço","1.4.0.0.19.","SINAPI",91929,"CABO DE COBRE FLEXÍVEL ISOLADO, 4 MM², ANTI-CHAMA 0,6/1,0 KV, PARA CIRCUITOS TERMINAIS - FORNECIMENTO E INSTALAÇÃO. AF_12/2015","M",2000,null,null,null,"Referência: AGETOP - 70582"]
["S",2,"S",0,1,4,0,0,0,0,0,"F","Serviço","Serviço","1.4.0.0.20.","SINAPI",91931,"CABO DE COBRE FLEXÍVEL ISOLADO, 6 MM², ANTI-CHAMA 0,6/1,0 KV, PARA CIRCUITOS TERMINAIS - FORNECIMENTO E INSTALAÇÃO. AF_12/2015","M",50,null,null,null,"Referência: AGETOP - 70583"]
["S",2,"S",0,{"$f":"IF($C64=1,OFFSET(E64,-1,0)+1,OFFSET(E64,-1,0))","v":1},{"$f":"IF($C64=1,0,IF($C64=2,OFFSET(F64,-1,0)+1,OFFSET(F64,-1,0)))","v":4},{"$f":"IF(AND($C64<=2,$C64<>0),0,IF($C64=3,OFFSET(G64,-1,0)+1,OFFSET(G64,-1,0)))","v":0},{"$f":"IF(AND($C64<=3,$C64<>0),0,IF($C64=4,OFFSET(H64,-1,0)+1,OFFSET(H64,-1,0)))","v":0},0,0,0,"F","Serviço","Serviço","1.4.0.0.21.","SINAPI",92868,"CAIXA RETANGULAR 4\" X 2\" MÉDIA (1,30 M DO PISO), METÁLICA, INSTALADA EM PAREDE - FORNECIMENTO E INSTALAÇÃO. AF_12/2015","UN",10,null,null,null,"Referência: AGETOP - 70691"]
["S",2,"S",0,1,4,0,0,0,0,0,"F","Serviço","Serviço","1.4.0.0.22.","SINAPI",97893,"CAIXA ENTERRADA ELÉTRICA RETANGULAR, EM ALVENARIA COM BLOCOS DE CONCRETO, FUNDO COM BRITA, DIMENSÕES INTERNAS: 0,8X0,8X0,6 M. AF_05/2018","UN",2,null,null,null,""]
["S",2,"S",0,1,4,0,0,0,0,0,"F","Serviço","Serviço","1.4.0.0.23.","AGETOP",70930,"CONDULETE METÁLICO - ADAPTADOR DE SAÍDA 3/4\" ","un    ",10,null,null,null,""]
["S",2,"S",0,1,4,0,0,0,0,0,"F","Serviço","Serviço","1.4.0.0.24.","SINAPI",91902,"CURVA 90 GRAUS PARA ELETRODUTO, PVC, ROSCÁVEL, DN 25 MM (3/4\"), PARA CIRCUITOS TERMINAIS, INSTALADA EM LAJE - FORNECIMENTO E INSTALAÇÃO. AF_12/2015","UN",30,null,null,null,"Referência: AGETOP - 71141"]
["S",2,"S",0,1,4,0,0,0,0,0,"F","Serviço","Serviço","1.4.0.0.25.","SINAPI",91905,"CURVA 90 GRAUS PARA ELETRODUTO, PVC, ROSCÁVEL, DN 32 MM (1\"), PARA CIRCUITOS TERMINAIS, INSTALADA EM LAJE - FORNECIMENTO E INSTALAÇÃO. AF_12/2015","UN",20,null,null,null,"Referência: AGETOP - 71142"]
["S",2,"S",0,1,4,0,0,0,0,0,"F","Serviço","Serviço","1.4.0.0.26.","SINAPI",93653,"DISJUNTOR MONOPOLAR TIPO DIN, CORRENTE NOMINAL DE 10A - FORNECIMENTO E INSTALAÇÃO. AF_04/2016","UN",10,null,null,null,""]
["S",{"$f":"IF(OR(C70=\"s\",C70=0),OFFSET(B70,-1,0),C70)","v":2},{"$f":"IF(OFFSET(C70,-1,0)=\"L\",1,IF(OFFSET(C70,-1,0)=1,2,IF(OR(A70=\"s\",A70=0),\"S\",IF(AND(OFFSET(C70,-1,0)=2,A70=4),3,IF(AND(OR(OFFSET(C70,-1,0)=\"s\",OFFSET(C70,-1,0)=0),A70<>\"s\",A70>OFFSET(B70,-1,0)),OFFSET(B70,-1,0),A70)))))","v":"S"},{"$f":"IF(OR(C70=\"S\",C70=0),0,IF(ISERROR(K70),J70,SMALL(J70:K70,1)))","v":0},1,4,0,0,0,0,0,"F","Serviço","Serviço","1.4.0.0.27.","SINAPI",93654,"DISJUNTOR MONOPOLAR TIPO DIN, CORRENTE NOMINAL DE 16A - FORNECIMENTO E INSTALAÇÃO. AF_04/2016","UN",16,null,null,null,""]
["S",2,"S",0,1,4,0,0,0,0,0,"F","Serviço","Serviço","1.4.0.0.28.","SINAPI",93656,"DISJUNTOR MONOPOLAR TIPO DIN, CORRENTE NOMINAL DE 25A - FORNECIMENTO E INSTALAÇÃO. AF_04/2016","UN",10,null,null,null,""]
["S",2,"S",0,1,4,0,0,0,0,0,"F","Serviço","Serviço","1.4.0.0.29.","SINAPI",93671,"DISJUNTOR TRIPOLAR TIPO DIN, CORRENTE NOMINAL DE 32A - FORNECIMENTO E INSTALAÇÃO. AF_04/2016","UN",4,null,null,null,"Referência: AGETOP - 71173"]
["S",2,"S",0,1,4,0,0,0,0,0,"F","Serviço","Serviço","1.4.0.0.30.","SINAPI",93673,"DISJUNTOR TRIPOLAR TIPO DIN, CORRENTE NOMINAL DE 50A - FORNECIMENTO E INSTALAÇÃO. AF_04/2016","UN",4,null,null,null,"Referência: AGETOP - 71174"]
["S",2,"S",0,1,4,0,0,0,0,0,"F","Serviço","Serviço","1.4.0.0.31.","SINAPI","74130/5","DISJUNTOR TERMOMAGNETICO TRIPOLAR PADRAO NEMA (AMERICANO) 60 A 100A 240V, FORNECIMENTO E INSTALACAO","UN",2,null,null,null,""]
["S",2,"S",0,1,4,0,0,0,0,0,"F","Serviço","Serviço","1.4.0.0.32.","AGETOP",71184,"DISPOSITIVO DE PROTEÇÃO CONTRA SURTOS (D.P.S.) 275V DE 8 A 40KA","Un    ",3,null,null,null,""]
["S",2,"S",0,1,4,0,0,0,0,0,"F","Serviço","Serviço","1.4.0.0.33.","SINAPI",91871,"ELETRODUTO RÍGIDO ROSCÁVEL, PVC, DN 25 MM (3/4\"), PARA CIRCUITOS TERMINAIS, INSTALADO EM PAREDE - FORNECIMENTO E INSTALAÇÃO. AF_12/2015","M",90,null,null,null,"Referência: AGETOP - 71201"]
["S",2,"S",0,1,4,0,0,0,0,0,"F","Serviço","Serviço","1.4.0.0.34.","SINAPI",91872,"ELETRODUTO RÍGIDO ROSCÁVEL, PVC, DN 32 MM (1\"), PARA CIRCUITOS TERMINAIS, INSTALADO EM PAREDE - FORNECIMENTO E INSTALAÇÃO. AF_12/2015","M",60,null,null,null,"Referência: AGETOP - 71202"]
["S",2,"S",0,1,4,0,0,0,0,0,"F","Serviço","Serviço","1.4.0.0.35.","SINAPI",93008,"ELETRODUTO RÍGIDO ROSCÁVEL, PVC, DN 50 MM (1 1/2\") - FORNECIMENTO E INSTALAÇÃO. AF_12/2015","M",30,null,null,null,""]
["S",2,"S",0,1,4,0,0,0,0,0,"F","Serviço","Serviço","1.4.0.0.36.","SINAPI",93009,"ELETRODUTO RÍGIDO ROSCÁVEL, PVC, DN 60 MM (2\") - FORNECIMENTO E INSTALAÇÃO. AF_12/2015","M",60,null,null,null,""]
["S",2,"S",0,1,4,0,0,0,0,0,"F","Serviço","Serviço","1.4.0.0.37.","AGETOP",71321,"FITA DE AUTO FUSAO, ROLO E 10,00 MM","Un    ",5,null,null,null,""]
["S",2,"S",0,1,4,0,0,0,0,0,"F","Serviço","Serviço","1.4.0.0.38.","AGETOP",71331,"FITA ISOLANTE, ROLO DE 20,00 M","Un    ",15,null,null,null,""]
["S",2,"S",0,1,4,0,0,0,0,0,"F","Serviço","Serviço","1.4.0.0.39.","AGETOP",71381,"HASTE REV.COBRE(COPPERWELD)  5/8\" X 3,00 M C/CONECTOR","Un    ",3,null,null,null,""]
["S",2,"S",0,1,4,0,0,0,{"$f":"IF(OR($C83=\"S\",$C83=0),0,MATCH(0,OFFSET($D83,1,$C83,ROW($C$575)-ROW($C83)),0))","v":0},{"$f":"IF(OR($C83=\"S\",$C83=0),0,MATCH(OFFSET($D83,0,$C83)+1,OFFSET($D83,1,$C83,ROW($C$575)-ROW($C83)),0))","v":0},"F","Serviço","Serviço","1.4.0.0.40.","SINAPI",91953,"INTERRUPTOR SIMPLES (1 MÓDULO), 10A/250V, INCLUINDO SUPORTE E PLACA - FORNECIMENTO E INSTALAÇÃO. AF_12/2015","UN",10,null,null,null,"Referência: AGETOP - 71440"]
["S",2,"S",0,1,4,0,0,0,0,0,"F","Serviço","Serviço","1.4.0.0.41.","COMPOSIÇÃO","COMP 387_SEE","LÂMPADA LED TUBULAR 18W ","UN ",60,null,null,null,""]
["S",2,"S",0,1,4,0,0,0,0,0,"","Serviço","Serviço","-","SINAPI",97608,"LUMINÁRIA ARANDELA TIPO TARTARUGA, COM GRADE, PARA 1 LÂMPADA DE 15 W - FORNECIMENTO E INSTALAÇÃO. AF_11/2017","UN",null,null,null,null,""]
["S",2,"S",0,1,4,0,0,0,0,0,"F","Serviço","Serviço","1.4.0.0.42.","SINAPI","73953/4","LUMINÁRIAS TIPO CALHA, DE SOBREPOR, COM REATORES DE PARTIDA RÁPIDA E LÂMPADAS FLUORESCENTES 2X2X18W, COMPLETAS, FORNECIMENTO E INSTALAÇÃO","UN",30,null,null,null,""]
["S",2,"S",0,1,4,0,0,0,0,0,"F","Serviço","Serviço","1.4.0.0.43.","SINAPI",91884,"LUVA PARA ELETRODUTO, PVC, ROSCÁVEL, DN 25 MM (3/4\"), PARA CIRCUITOS TERMINAIS, INSTALADA EM PAREDE - FORNECIMENTO E INSTALAÇÃO. AF_12/2015","UN",30,null,null,null,"Referência: AGETOP - 71741"]
["S",2,"S",0,1,4,0,0,0,0,0,"F","Serviço","Serviço","1.4.0.0.44.","SINAPI",91885,"LUVA PARA ELETRODUTO, PVC, ROSCÁVEL, DN 32 MM (1\"), PARA CIRCUITOS TERMINAIS, INSTALADA EM PAREDE - FORNECIMENTO E INSTALAÇÃO. AF_12/2015","UN",20,null,null,null,"Referência: AGETOP - 71742"]
["S",2,"S",0,1,4,0,0,0,0,0,"F","Serviço","Serviço","1.4.0.0.45.","SINAPI",93013,"LUVA PARA ELETRODUTO, PVC, ROSCÁVEL, DN 50 MM (1 1/2\") - FORNECIMENTO E INSTALAÇÃO. AF_12/2015","UN",10,null,null,null,"Referência: AGETOP - 71744"]
["S",2,"S",0,1,4,0,0,0,0,0,"F","Serviço","Serviço","1.4.0.0.46.","SINAPI",93014,"LUVA PARA ELETRODUTO, PVC, ROSCÁVEL, DN 60 MM (2\") - FORNECIMENTO E INSTALAÇÃO. AF_12/2015","UN",10,null,null,null,"Referência: AGETOP - 71745"]
["S",2,"S",0,1,4,0,0,0,0,0,"F","Serviço","Serviço","1.4.0.0.47.","AGETOP",71824,"PADRÃO TRIFASICO 35 MM H=7 METROS","Un    ",1,null,null,null,""]
["S",2,"S",0,1,4,0,0,0,0,0,"F","Serviço","Serviço","1.4.0.0.48.","SINAPI","74131/5","QUADRO DE DISTRIBUICAO DE ENERGIA DE EMBUTIR, EM CHAPA METALICA, PARA 24 DISJUNTORES TERMOMAGNETICOS MONOPOLARES, COM BARRAMENTO TRIFASICO E NEUTRO, FORNECIMENTO E INSTALACAO","UN",2,null,null,null,""]
["S",2,"S",0,1,4,0,0,0,0,0,"F","Serviço","Serviço","1.4.0.0.49.","AGETOP",72425,"TAMPA CEGA PLASTICA RETANGULAR 4\"X2\"","Un    ",10,null,null,null,""]
["S",2,"S",0,1,4,0,0,0,0,0,"F","Serviço","Serviço","1.4.0.0.50.","SINAPI",92000,"TOMADA BAIXA DE EMBUTIR (1 MÓDULO), 2P+T 10 A, INCLUINDO SUPORTE E PLACA - FORNECIMENTO E INSTALAÇÃO. AF_12/2015","UN",20,null,null,null,"Referência: AGETOP - 72578"]
["S",2,"S",0,1,4,0,0,0,0,0,"F","Serviço","Serviço","1.4.0.0.51.","SINAPI",91993,"TOMADA ALTA DE EMBUTIR (1 MÓDULO), 2P+T 20 A, INCLUINDO SUPORTE E PLACA - FORNECIMENTO E INSTALAÇÃO. AF_12/2015","UN",15,null,null,null,"Referência: AGETOP - 72585"]
[{"$f":"CHOOSE(1+LOG(1+2*(ORÇAMENTO.Nivel=\"Nível 1\")+4*(ORÇAMENTO.Nivel=\"Nível 2\")+8*(ORÇAMENTO.Nivel=\"Nível 3\")+16*(ORÇAMENTO.Nivel=\"Nível 4\")+32*(ORÇAMENTO.Nivel=\"Serviço\"),2),0,1,2,3,4,\"S\")","v":2},{"$f":"IF(OR(C96=\"s\",C96=0),OFFSET(B96,-1,0),C96)","v":2},{"$f":"IF(OFFSET(C96,-1,0)=\"L\",1,IF(OFFSET(C96,-1,0)=1,2,IF(OR(A96=\"s\",A96=0),\"S\",IF(AND(OFFSET(C96,-1,0)=2,A96=4),3,IF(AND(OR(OFFSET(C96,-1,0)=\"s\",OFFSET(C96,-1,0)=0),A96<>\"s\",A96>OFFSET(B96,-1,0)),OFFSET(B96,-1,0),A96)))))","v":2},{"$f":"IF(OR(C96=\"S\",C96=0),0,IF(ISERROR(K96),J96,SMALL(J96:K96,1)))","v":68},{"$f":"IF($C96=1,OFFSET(E96,-1,0)+1,OFFSET(E96,-1,0))","v":1},{"$f":"IF($C96=1,0,IF($C96=2,OFFSET(F96,-1,0)+1,OFFSET(F96,-1,0)))","v":5},{"$f":"IF(AND($C96<=2,$C96<>0),0,IF($C96=3,OFFSET(G96,-1,0)+1,OFFSET(G96,-1,0)))","v":0},{"$f":"IF(AND($C96<=3,$C96<>0),0,IF($C96=4,OFFSET(H96,-1,0)+1,OFFSET(H96,-1,0)))","v":0},{"$f":"IF(AND($C96<=4,$C96<>0),0,IF(AND($C96=\"S\",$W96>0),OFFSET(I96,-1,0)+1,OFFSET(I96,-1,0)))","v":0},108,68,"F","Nível 2","Nível 2","1.5.","AGETOP",null,"INSTALAÇÕES HIDROSSANITÁRIAS","-",null,null,null,null,""]
[3,3,3,7,1,5,1,0,0,67,7,"F","Nível 3","Nível 3","1.5.1.","SINAPI",null,"PEÇAS E ACESSÓRIOS","-",null,null,null,null,""]
[4,4,4,3,1,5,1,1,0,6,3,"F","Nível 4","Nível 4","1.5.1.1.","SINAPI",null,"CAIXAS E CURVAS","-",null,null,null,null,""]
["S",4,"S",0,1,5,1,1,0,0,0,"F","Serviço","Serviço","1.5.1.1.1.","SINAPI",6171,"TAMPA DE CONCRETO ARMADO 60X60X5CM PARA CAIXA","UN",4,null,null,null,""]
["S",4,"S",0,1,5,1,1,0,0,0,"F","Serviço","Serviço","1.5.1.1.2.","AGETOP",70715,"CAIXA DE PASSAGEM 60X60X80CM FUNDO DE BRITA SEM TAMPA","Un    ",4,null,null,null,""]
[{"$f":"CHOOSE(1+LOG(1+2*(ORÇAMENTO.Nivel=\"Nível 1\")+4*(ORÇAMENTO.Nivel=\"Nível 2\")+8*(ORÇAMENTO.Nivel=\"Nível 3\")+16*(ORÇAMENTO.Nivel=\"Nível 4\")+32*(ORÇAMENTO.Nivel=\"Serviço\"),2),0,1,2,3,4,\"S\")","v":4},4,4,3,1,5,1,2,{"$f":"IF(AND($C101<=4,$C101<>0),0,IF(AND($C101=\"S\",$W101>0),OFFSET(I101,-1,0)+1,OFFSET(I101,-1,0)))","v":0},3,16,"F","Nível 4","Nível 4","1.5.1.2.","SINAPI",null,"REGISTROS","-",null,null,null,null,""]
["S",4,"S",0,{"$f":"IF($C102=1,OFFSET(E102,-1,0)+1,OFFSET(E102,-1,0))","v":1},{"$f":"IF($C102=1,0,IF($C102=2,OFFSET(F102,-1,0)+1,OFFSET(F102,-1,0)))","v":5},{"$f":"IF(AND($C102<=2,$C102<>0),0,IF($C102=3,OFFSET(G102,-1,0)+1,OFFSET(G102,-1,0)))","v":1},{"$f":"IF(AND($C102<=3,$C102<>0),0,IF($C102=4,OFFSET(H102,-1,0)+1,OFFSET(H102,-1,0)))","v":2},0,0,0,"F","Serviço","Serviço","1.5.1.2.1.","SINAPI",94499,"REGISTRO DE GAVETA BRUTO, LATÃO, ROSCÁVEL, 2 1/2\u0094, INSTALADO EM RESERVAÇÃO DE ÁGUA DE EDIFICAÇÃO QUE POSSUA RESERVATÓRIO DE FIBRA/FIBROCIMENTO \u0096 FORNECIMENTO E INSTALAÇÃO. AF_06/2016","UN",1,null,null,null,"Referência: AGETOP - 80910"]
["S",4,"S",0,1,5,1,2,0,0,0,"F","Serviço","Serviço","1.5.1.2.2.","SINAPI",94498,"REGISTRO DE GAVETA BRUTO, LATÃO, ROSCÁVEL, 2\u0094, INSTALADO EM RESERVAÇÃO DE ÁGUA DE EDIFICAÇÃO QUE POSSUA RESERVATÓRIO DE FIBRA/FIBROCIMENTO \u0096 FORNECIMENTO E INSTALAÇÃO. AF_06/2016","UN",1,null,null,null,"Referência: AGETOP - 80906"]
[3,{"$f":"IF(OR(C104=\"s\",C104=0),OFFSET(B104,-1,0),C104)","v":3},{"$f":"IF(OFFSET(C104,-1,0)=\"L\",1,IF(OFFSET(C104,-1,0)=1,2,IF(OR(A104=\"s\",A104=0),\"S\",IF(AND(OFFSET(C104,-1,0)=2,A104=4),3,IF(AND(OR(OFFSET(C104,-1,0)=\"s\",OFFSET(C104,-1,0)=0),A104<>\"s\",A104>OFFSET(B104,-1,0)),OFFSET(B104,-1,0),A104)))))","v":3},{"$f":"IF(OR(C104=\"S\",C104=0),0,IF(ISERROR(K104),J104,SMALL(J104:K104,1)))","v":43},1,5,2,0,0,60,43,"F","Nível 3","Nível 3","1.5.2.","SINAPI",null,"ÁGUA FRIA","-",null,null,null,null,""]
[4,4,4,6,1,5,2,1,0,42,6,"F","Nível 4","Nível 4","1.5.2.1.","SINAPI",null,"TUBOS DE PVC SOLDÁVEL","-",null,null,null,null,""]
["S",4,"S",0,1,5,2,1,0,0,0,"F","Serviço","Serviço","1.5.2.1.1.","SINAPI",89402,"TUBO, PVC, SOLDÁVEL, DN 25MM, INSTALADO EM RAMAL DE DISTRIBUIÇÃO DE ÁGUA - FORNECIMENTO E INSTALAÇÃO. AF_12/2014","M",6,null,null,null,"Referência: AGETOP - 81003"]
["S",4,"S",0,1,5,2,1,0,0,0,"F","Serviço","Serviço","1.5.2.1.2.","SINAPI",89447,"TUBO, PVC, SOLDÁVEL, DN 32MM, INSTALADO EM PRUMADA DE ÁGUA - FORNECIMENTO E INSTALAÇÃO. AF_12/2014","M",12,null,null,null,""]
["S",4,"S",0,1,5,2,1,0,0,0,"F","Serviço","Serviço","1.5.2.1.3.","SINAPI",89449,"TUBO, PVC, SOLDÁVEL, DN 50MM, INSTALADO EM PRUMADA DE ÁGUA - FORNECIMENTO E INSTALAÇÃO. AF_12/2014","M",6,null,null,null,""]
["S",4,"S",0,1,5,2,1,0,0,0,"F","Serviço","Serviço","1.5.2.1.4.","SINAPI",89450,"TUBO, PVC, SOLDÁVEL, DN 60MM, INSTALADO EM PRUMADA DE ÁGUA - FORNECIMENTO E INSTALAÇÃO. AF_12/2014","M",54,null,null,null,""]
["S",4,"S",0,1,5,2,1,0,0,0,"F","Serviço","Serviço","1.5.2.1.5.","SINAPI",89451,"TUBO, PVC, SOLDÁVEL, DN 75MM, INSTALADO EM PRUMADA DE ÁGUA - FORNECIMENTO E INSTALAÇÃO. AF_12/2014","M",12,null,null,null,""]
[4,4,4,6,1,5,2,2,0,36,6,"F","Nível 4","Nível 4","1.5.2.2.","SINAPI",null,"ADAPTADORES DE PVC SOLDÁVEL","-",null,null,null,null,""]
["S",4,"S",0,1,5,2,2,0,0,0,"F","Serviço","Serviço","1.5.2.2.1.","SINAPI",94709,"ADAPTADOR COM FLANGES LIVRES, PVC, SOLDÁVEL, DN 32 MM X 1 , INSTALADO EM RESERVAÇÃO DE ÁGUA DE EDIFICAÇÃO QUE POSSUA RESERVATÓRIO DE FIBRA/FIBROCIMENTO   FORNECIMENTO E INSTALAÇÃO. AF_06/2016","UN",1,null,null,null,"Referência: AGETOP - 81042"]
["S",4,"S",0,1,5,2,2,0,0,0,"F","Serviço","Serviço","1.5.2.2.2.","SINAPI",94713,"ADAPTADOR COM FLANGES LIVRES, PVC, SOLDÁVEL, DN 75 MM X 2 1/2 , INSTALADO EM RESERVAÇÃO DE ÁGUA DE EDIFICAÇÃO QUE POSSUA RESERVATÓRIO DE FIBRA/FIBROCIMENTO   FORNECIMENTO E INSTALAÇÃO. AF_06/2016","UN",1,null,null,null,""]
["S",4,"S",0,1,5,2,2,0,0,0,"F","Serviço","Serviço","1.5.2.2.3.","SINAPI",94712,"ADAPTADOR COM FLANGES LIVRES, PVC, SOLDÁVEL, DN 60 MM X 2 , INSTALADO EM RESERVAÇÃO DE ÁGUA DE EDIFICAÇÃO QUE POSSUA RESERVATÓRIO DE FIBRA/FIBROCIMENTO   FORNECIMENTO E INSTALAÇÃO. AF_06/2016","UN",1,null,null,null,"Referência: AGETOP - 81044"]
["S",4,"S",0,1,5,2,2,0,0,0,"F","Serviço","Serviço","1.5.2.2.4.","SINAPI",89610,"ADAPTADOR CURTO COM BOLSA E ROSCA PARA REGISTRO, PVC, SOLDÁVEL, DN 60MM X 2\u0094, INSTALADO EM PRUMADA DE ÁGUA - FORNECIMENTO E INSTALAÇÃO. AF_12/2014","UN",2,null,null,null,""]
["S",4,"S",0,1,5,2,2,0,0,0,"F","Serviço","Serviço","1.5.2.2.5.","SINAPI",89613,"ADAPTADOR CURTO COM BOLSA E ROSCA PARA REGISTRO, PVC, SOLDÁVEL, DN 75MM X 2.1/2\u0094, INSTALADO EM PRUMADA DE ÁGUA - FORNECIMENTO E INSTALAÇÃO. AF_12/2014","UN",2,null,null,null,"Referência: AGETOP - 81071"]
[4,4,4,6,1,5,2,3,0,30,6,"F","Nível 4","Nível 4","1.5.2.3.","SINAPI",null,"LUVAS DE PVC","-",null,null,null,null,""]
["S",4,"S",0,1,5,2,3,0,0,0,"F","Serviço","Serviço","1.5.2.3.1.","SINAPI",89528,"LUVA, PVC, SOLDÁVEL, DN 25MM, INSTALADO EM PRUMADA DE ÁGUA - FORNECIMENTO E INSTALAÇÃO. AF_12/2014","UN",2,null,null,null,""]
["S",4,"S",0,1,5,2,3,0,0,0,"F","Serviço","Serviço","1.5.2.3.2.","SINAPI",89431,"LUVA, PVC, SOLDÁVEL, DN 32MM, INSTALADO EM RAMAL DE DISTRIBUIÇÃO DE ÁGUA - FORNECIMENTO E INSTALAÇÃO. AF_12/2014","UN",4,null,null,null,"Referência: AGETOP - 81103"]
["S",4,"S",0,1,5,2,3,0,0,0,"F","Serviço","Serviço","1.5.2.3.3.","SINAPI",89575,"LUVA, PVC, SOLDÁVEL, DN 50MM, INSTALADO EM PRUMADA DE ÁGUA - FORNECIMENTO E INSTALAÇÃO. AF_12/2014","UN",3,null,null,null,"Referência: AGETOP - 81105"]
["S",4,"S",0,1,5,2,3,0,0,0,"F","Serviço","Serviço","1.5.2.3.4.","SINAPI",89597,"LUVA, PVC, SOLDÁVEL, DN 60MM, INSTALADO EM PRUMADA DE ÁGUA - FORNECIMENTO E INSTALAÇÃO. AF_12/2014","UN",10,null,null,null,""]
["S",4,"S",0,1,5,2,3,0,0,0,"F","Serviço","Serviço","1.5.2.3.5.","SINAPI",89611,"LUVA, PVC, SOLDÁVEL, DN 75MM, INSTALADO EM PRUMADA DE ÁGUA - FORNECIMENTO E INSTALAÇÃO. AF_12/2014","UN",4,null,null,null,""]
[4,4,4,7,1,5,2,4,0,24,7,"F","Nível 4","Nível 4","1.5.2.4.","SINAPI",null,"BUCHAS","-",null,null,null,null,""]
["S",4,"S",0,1,5,2,4,0,0,0,"F","Serviço","Serviço","1.5.2.4.1.","SINAPI",96662,"BUCHA DE REDUÇÃO, PPR, 32 X 25, CLASSE PN 25, INSTALADO EM RAMAL DE DISTRIBUIÇÃO DE ÁGUA \u0096 FORNECIMENTO E INSTALAÇÃO . AF_06/2015","UN",2,null,null,null,""]
["S",4,"S",0,1,5,2,4,0,0,0,"F","Serviço","Serviço","1.5.2.4.2.","SINAPI",89605,"LUVA DE REDUÇÃO, PVC, SOLDÁVEL, DN 60MM X 50MM, INSTALADO EM PRUMADA DE ÁGUA - FORNECIMENTO E INSTALAÇÃO. AF_12/2014","UN",2,null,null,null,""]
["S",4,"S",0,1,5,2,4,0,0,0,"F","Serviço","Serviço","1.5.2.4.3.","SINAPI",89579,"LUVA DE REDUÇÃO, PVC, SOLDÁVEL, DN 50MM X 25MM, INSTALADO EM PRUMADA DE ÁGUA   FORNECIMENTO E INSTALAÇÃO. AF_12/2014","UN",2,null,null,null,""]
["S",4,"S",0,1,5,2,4,0,0,0,"F","Serviço","Serviço","1.5.2.4.4.","AGETOP",81180,"BUCHA DE REDUCAO SOLDAVEL LONGA 50 X 32 mm","Un    ",2,null,null,null,""]
["S",4,"S",0,1,5,2,4,0,0,0,"F","Serviço","Serviço","1.5.2.4.5.","AGETOP",81185,"BUCHA DE REDUÇÃO SOLDÁVEL LONGA 75 X 50 MM","un    ",2,null,null,null,""]
["S",4,"S",0,1,5,2,4,0,0,0,"F","Serviço","Serviço","1.5.2.4.6.","AGETOP",81166,"BUCHA DE REDUCAO SOLDAVEL CURTA 75 X 60 mm","Un    ",2,null,null,null,""]
[4,4,4,5,1,5,2,5,0,17,5,"F","Nível 4","Nível 4","1.5.2.5.","SINAPI",null,"JOELHO","-",null,null,null,null,""]
["S",4,"S",0,1,5,2,5,0,0,0,"F","Serviço","Serviço","1.5.2.5.1.","SINAPI",89413,"JOELHO 90 GRAUS, PVC, SOLDÁVEL, DN 32MM, INSTALADO EM RAMAL DE DISTRIBUIÇÃO DE ÁGUA - FORNECIMENTO E INSTALAÇÃO. AF_12/2014","UN",3,null,null,null,"Referência: AGETOP - 81322"]
["S",4,"S",0,1,5,2,5,0,0,0,"F","Serviço","Serviço","1.5.2.5.2.","SINAPI",89501,"JOELHO 90 GRAUS, PVC, SOLDÁVEL, DN 50MM, INSTALADO EM PRUMADA DE ÁGUA - FORNECIMENTO E INSTALAÇÃO. AF_12/2014","UN",1,null,null,null,""]
["S",4,"S",0,1,5,2,5,0,0,0,"F","Serviço","Serviço","1.5.2.5.3.","SINAPI",89505,"JOELHO 90 GRAUS, PVC, SOLDÁVEL, DN 60MM, INSTALADO EM PRUMADA DE ÁGUA - FORNECIMENTO E INSTALAÇÃO. AF_12/2014","UN",3,null,null,null,"Referência: AGETOP - 81325"]
["S",4,"S",0,1,5,2,5,0,0,0,"F","Serviço","Serviço","1.5.2.5.4.","SINAPI",89513,"JOELHO 90 GRAUS, PVC, SOLDÁVEL, DN 75MM, INSTALADO EM PRUMADA DE ÁGUA - FORNECIMENTO E INSTALAÇÃO. AF_12/2014","UN",2,null,null,null,"Referência: AGETOP - 81326"]
[{"$f":"CHOOSE(1+LOG(1+2*(ORÇAMENTO.Nivel=\"Nível 1\")+4*(ORÇAMENTO.Nivel=\"Nível 2\")+8*(ORÇAMENTO.Nivel=\"Nível 3\")+16*(ORÇAMENTO.Nivel=\"Nível 4\")+32*(ORÇAMENTO.Nivel=\"Serviço\"),2),0,1,2,3,4,\"S\")","v":4},4,4,9,{"$f":"IF($C135=1,OFFSET(E135,-1,0)+1,OFFSET(E135,-1,0))","v":1},{"$f":"IF($C135=1,0,IF($C135=2,OFFSET(F135,-1,0)+1,OFFSET(F135,-1,0)))","v":5},{"$f":"IF(AND($C135<=2,$C135<>0),0,IF($C135=3,OFFSET(G135,-1,0)+1,OFFSET(G135,-1,0)))","v":2},{"$f":"IF(AND($C135<=3,$C135<>0),0,IF($C135=4,OFFSET(H135,-1,0)+1,OFFSET(H135,-1,0)))","v":6},{"$f":"IF(AND($C135<=4,$C135<>0),0,IF(AND($C135=\"S\",$W135>0),OFFSET(I135,-1,0)+1,OFFSET(I135,-1,0)))","v":0},12,9,"F","Nível 4","Nível 4","1.5.2.6.","SINAPI",null,"TÊ","-",null,null,null,null,""]
["S",{"$f":"IF(OR(C136=\"s\",C136=0),OFFSET(B136,-1,0),C136)","v":4},{"$f":"IF(OFFSET(C136,-1,0)=\"L\",1,IF(OFFSET(C136,-1,0)=1,2,IF(OR(A136=\"s\",A136=0),\"S\",IF(AND(OFFSET(C136,-1,0)=2,A136=4),3,IF(AND(OR(OFFSET(C136,-1,0)=\"s\",OFFSET(C136,-1,0)=0),A136<>\"s\",A136>OFFSET(B136,-1,0)),OFFSET(B136,-1,0),A136)))))","v":"S"},{"$f":"IF(OR(C136=\"S\",C136=0),0,IF(ISERROR(K136),J136,SMALL(J136:K136,1)))","v":0},1,5,2,6,0,0,0,"F","Serviço","Serviço","1.5.2.6.1.","SINAPI",89617,"TE, PVC, SOLDÁVEL, DN 25MM, INSTALADO EM PRUMADA DE ÁGUA - FORNECIMENTO E INSTALAÇÃO. AF_12/2014","UN",1,null,null,null,""]
["S",4,"S",0,1,5,2,6,0,0,0,"F","Serviço","Serviço","1.5.2.6.2.","SINAPI",89443,"TE, PVC, SOLDÁVEL, DN 32MM, INSTALADO EM RAMAL DE DISTRIBUIÇÃO DE ÁGUA - FORNECIMENTO E INSTALAÇÃO. AF_12/2014","UN",1,null,null,null,"Referência: AGETOP - 81403"]
["S",4,"S",0,1,5,2,6,0,0,0,"F","Serviço","Serviço","1.5.2.6.3.","SINAPI",89625,"TE, PVC, SOLDÁVEL, DN 50MM, INSTALADO EM PRUMADA DE ÁGUA - FORNECIMENTO E INSTALAÇÃO. AF_12/2014","UN",1,null,null,null,"Referência: AGETOP - 81405"]
["S",4,"S",0,1,5,2,6,0,0,0,"F","Serviço","Serviço","1.5.2.6.4.","SINAPI",89628,"TE, PVC, SOLDÁVEL, DN 60MM, INSTALADO EM PRUMADA DE ÁGUA - FORNECIMENTO E INSTALAÇÃO. AF_12/2014","UN",1,null,null,null,"Referência: AGETOP - 81406"]
["S",4,"S",0,1,5,2,6,0,0,0,"F","Serviço","Serviço","1.5.2.6.5.","SINAPI",89629,"TE, PVC, SOLDÁVEL, DN 75MM, INSTALADO EM PRUMADA DE ÁGUA - FORNECIMENTO E INSTALAÇÃO. AF_12/2014","UN",1,null,null,null,"Referência: AGETOP - 81407"]
["S",4,"S",0,1,5,2,6,0,0,0,"F","Serviço","Serviço","1.5.2.6.6.","SINAPI",89627,"TÊ DE REDUÇÃO, PVC, SOLDÁVEL, DN 50MM X 25MM, INSTALADO EM PRUMADA DE ÁGUA - FORNECIMENTO E INSTALAÇÃO. AF_12/2014","UN",1,null,null,null,""]
["S",4,"S",0,1,5,2,6,0,0,0,"F","Serviço","Serviço","1.5.2.6.7.","AGETOP",81425,"TE REDUCAO 90 GRAUS SOLDAVEL 50 X 32 mm","Un    ",1,null,null,null,""]
["S",4,"S",0,1,5,2,6,0,0,0,"F","Serviço","Serviço","1.5.2.6.8.","SINAPI",94698,"TÊ DE REDUÇÃO, PVC, SOLDÁVEL, DN 75 MM X 50 MM, INSTALADO EM RESERVAÇÃO DE ÁGUA DE EDIFICAÇÃO QUE POSSUA RESERVATÓRIO DE FIBRA/FIBROCIMENTO   FORNECIMENTO E INSTALAÇÃO. AF_06/2016","UN",2,null,null,null,"Referência: AGETOP - 81427"]
[4,4,4,3,1,5,2,7,0,3,{"$error":"#N/A"},"F","Nível 4","Nível 4","1.5.2.7.","SINAPI",null,"ADESIVOS","-",null,null,null,null,""]
["S",4,"S",0,1,5,2,7,0,0,0,"F","Serviço","Serviço","1.5.2.7.1.","AGETOP",81501,"ADESIVO PLASTICO - FRASCO 850 G","Un    ",3,null,null,null,""]
["S",4,"S",0,1,5,2,7,0,0,0,"F","Serviço","Serviço","1.5.2.7.2.","AGETOP",81504,"SOLUCAO LIMPADORA 1000 CM3","Un    ",3,null,null,null,""]
[3,3,3,5,1,5,3,0,0,{"$f":"IF(OR($C147=\"S\",$C147=0),0,MATCH(0,OFFSET($D147,1,$C147,ROW($C$575)-ROW($C147)),0))","v":17},{"$f":"IF(OR($C147=\"S\",$C147=0),0,MATCH(OFFSET($D147,0,$C147)+1,OFFSET($D147,1,$C147,ROW($C$575)-ROW($C147)),0))","v":5},"F","Nível 3","Nível 3","1.5.3.","SINAPI",null,"ESGOTO SANITÁRIO","-",null,null,null,null,""]
[{"$f":"CHOOSE(1+LOG(1+2*(ORÇAMENTO.Nivel=\"Nível 1\")+4*(ORÇAMENTO.Nivel=\"Nível 2\")+8*(ORÇAMENTO.Nivel=\"Nível 3\")+16*(ORÇAMENTO.Nivel=\"Nível 4\")+32*(ORÇAMENTO.Nivel=\"Serviço\"),2),0,1,2,3,4,\"S\")","v":4},4,4,2,1,5,3,1,{"$f":"IF(AND($C148<=4,$C148<>0),0,IF(AND($C148=\"S\",$W148>0),OFFSET(I148,-1,0)+1,OFFSET(I148,-1,0)))","v":0},4,2,"F","Nível 4","Nível 4","1.5.3.1.","SINAPI",null,"LUVAS","-",null,null,null,null,""]
["S",4,"S",0,1,5,3,1,0,0,0,"F","Serviço","Serviço","1.5.3.1.1.","SINAPI",89778,"LUVA SIMPLES, PVC, SERIE NORMAL, ESGOTO PREDIAL, DN 100 MM, JUNTA ELÁSTICA, FORNECIDO E INSTALADO EM RAMAL DE DESCARGA OU RAMAL DE ESGOTO SANITÁRIO. AF_12/2014","UN",11,null,null,null,"Referência: AGETOP - 82004"]
[4,{"$f":"IF(OR(C150=\"s\",C150=0),OFFSET(B150,-1,0),C150)","v":4},{"$f":"IF(OFFSET(C150,-1,0)=\"L\",1,IF(OFFSET(C150,-1,0)=1,2,IF(OR(A150=\"s\",A150=0),\"S\",IF(AND(OFFSET(C150,-1,0)=2,A150=4),3,IF(AND(OR(OFFSET(C150,-1,0)=\"s\",OFFSET(C150,-1,0)=0),A150<>\"s\",A150>OFFSET(B150,-1,0)),OFFSET(B150,-1,0),A150)))))","v":4},{"$f":"IF(OR(C150=\"S\",C150=0),0,IF(ISERROR(K150),J150,SMALL(J150:K150,1)))","v":2},{"$f":"IF($C150=1,OFFSET(E150,-1,0)+1,OFFSET(E150,-1,0))","v":1},{"$f":"IF($C150=1,0,IF($C150=2,OFFSET(F150,-1,0)+1,OFFSET(F150,-1,0)))","v":5},{"$f":"IF(AND($C150<=2,$C150<>0),0,IF($C150=3,OFFSET(G150,-1,0)+1,OFFSET(G150,-1,0)))","v":3},{"$f":"IF(AND($C150<=3,$C150<>0),0,IF($C150=4,OFFSET(H150,-1,0)+1,OFFSET(H150,-1,0)))","v":2},0,2,{"$error":"#N/A"},"F","Nível 4","Nível 4","1.5.3.2.","SINAPI",null,"TUBOS","-",null,null,null,null,""]
["S",4,"S",0,1,5,3,2,0,0,0,"F","Serviço","Serviço","1.5.3.2.1.","SINAPI",89800,"TUBO PVC, SERIE NORMAL, ESGOTO PREDIAL, DN 100 MM, FORNECIDO E INSTALADO EM PRUMADA DE ESGOTO SANITÁRIO OU VENTILAÇÃO. AF_12/2014","M",66,null,null,null,""]
[3,3,3,4,1,5,4,0,0,12,4,"F","Nível 3","Nível 3","1.5.4.","SINAPI",null,"OUTROS","-",null,null,null,null,""]
["S",3,"S",0,1,5,4,0,0,0,0,"F","Serviço","Serviço","1.5.4.0.1.","AGETOP",80845,"CAIXA DE ALVENARIA 20x20x25 CM (REVESTIMENTO IMPERMEABILIZADO), FUNDO DE BRITA SEM TAMPA - PARA REGISTRO/TORNEIRA JARDIM","Un    ",2,null,null,null,""]
["S",3,"S",0,1,5,4,0,0,0,0,"F","Serviço","Serviço","1.5.4.0.2.","AGETOP",80840,"TAMPA T-5 ARTICULADA 20X20","Un    ",2,null,null,null,""]
["S",3,"S",0,1,5,4,0,0,0,0,"F","Serviço","Serviço","1.5.4.0.3.","AGETOP",81882,"RES.METALICO TAÇA AÇO PATINÁVEL-V=15M3-COL.SEC.H=6M+FUNDAÇÃO+LOGOTIPO","Un    ",1,null,null,null,""]
[3,3,3,8,1,5,5,0,0,8,{"$error":"#N/A"},"F","Nível 3","Nível 3","1.5.5.","SINAPI",null,"INCENDIO","-",null,null,null,null,""]
["S",3,"S",0,1,5,5,0,0,0,0,"F","Serviço","Serviço","1.5.5.0.1.","AGETOP",85006,"EXTINTOR MULTI USO EM PO A B C (6 KG) - CAPACIDADE EXTINTORA 3A 20BC","un    ",3,null,null,null,""]
["S",3,"S",0,1,5,5,0,0,0,0,"F","Serviço","Serviço","1.5.5.0.2.","AGETOP",85005,"EXTINTOR AGUA PRESSURIZADA (10 LITROS) - CAPACIDADE EXTINTORA 2A","Un    ",2,null,null,null,""]
["S",3,"S",0,1,5,5,0,0,0,0,"F","Serviço","Serviço","1.5.5.0.3.","AGETOP",85003,"EXTINTOR PO QUIMICO SECO (6 KG) - CAPACIDADE EXTINTORA 20 BC","Un    ",1,null,null,null,""]
["S",3,"S",0,1,5,5,0,0,0,0,"F","Serviço","Serviço","1.5.5.0.4.","COMPOSIÇÃO","COMP 024_SEE","SINALIZADOR FOTOLUMINESCENTE PARA EXTINTOR","UN ",6,null,null,null,""]
["S",3,"S",0,1,5,5,0,0,0,0,"F","Serviço","Serviço","1.5.5.0.5.","COMPOSIÇÃO","COMP 025_SEE","SINALIZADOR FOTOLUMINESCENTE DE EMERGÊNCIA","UN ",15,null,null,null,""]
["S",3,"S",0,1,5,5,0,0,0,0,"F","Serviço","Serviço","1.5.5.0.6.","COMPOSIÇÃO","COMP 277_SEE","MARCAÇÃO NO PISO - 1X1 M PARA EXTINTOR","M2",6,null,null,null,""]
["S",3,"S",0,1,5,5,0,0,0,0,"F","Serviço","Serviço","1.5.5.0.7.","AGETOP",71598,"LUMINÁRIA DE EMERGÊNCIA 30 LEDS","un    ",8,null,null,null,""]
[{"$f":"CHOOSE(1+LOG(1+2*(ORÇAMENTO.Nivel=\"Nível 1\")+4*(ORÇAMENTO.Nivel=\"Nível 2\")+8*(ORÇAMENTO.Nivel=\"Nível 3\")+16*(ORÇAMENTO.Nivel=\"Nível 4\")+32*(ORÇAMENTO.Nivel=\"Serviço\"),2),0,1,2,3,4,\"S\")","v":2},{"$f":"IF(OR(C164=\"s\",C164=0),OFFSET(B164,-1,0),C164)","v":2},{"$f":"IF(OFFSET(C164,-1,0)=\"L\",1,IF(OFFSET(C164,-1,0)=1,2,IF(OR(A164=\"s\",A164=0),\"S\",IF(AND(OFFSET(C164,-1,0)=2,A164=4),3,IF(AND(OR(OFFSET(C164,-1,0)=\"s\",OFFSET(C164,-1,0)=0),A164<>\"s\",A164>OFFSET(B164,-1,0)),OFFSET(B164,-1,0),A164)))))","v":2},{"$f":"IF(OR(C164=\"S\",C164=0),0,IF(ISERROR(K164),J164,SMALL(J164:K164,1)))","v":2},{"$f":"IF($C164=1,OFFSET(E164,-1,0)+1,OFFSET(E164,-1,0))","v":1},{"$f":"IF($C164=1,0,IF($C164=2,OFFSET(F164,-1,0)+1,OFFSET(F164,-1,0)))","v":6},{"$f":"IF(AND($C164<=2,$C164<>0),0,IF($C164=3,OFFSET(G164,-1,0)+1,OFFSET(G164,-1,0)))","v":0},{"$f":"IF(AND($C164<=3,$C164<>0),0,IF($C164=4,OFFSET(H164,-1,0)+1,OFFSET(H164,-1,0)))","v":0},{"$f":"IF(AND($C164<=4,$C164<>0),0,IF(AND($C164=\"S\",$W164>0),OFFSET(I164,-1,0)+1,OFFSET(I164,-1,0)))","v":0},40,2,"F","Nível 2","Nível 2","1.6.",null,null,"ESTRUTURA DE MADEIRA","-",null,null,null,null,""]
["S",2,"S",0,1,6,0,0,0,0,0,"F","Serviço","Serviço","1.6.0.0.1.","SINAPI",92541,"TRAMA DE MADEIRA COMPOSTA POR RIPAS, CAIBROS E TERÇAS PARA TELHADOS DE ATÉ 2 ÁGUAS PARA TELHA CERÂMICA CAPA-CANAL, INCLUSO TRANSPORTE VERTICAL. AF_12/2015","M2",200,null,null,null,"Referência: AGETOP - 140202"]
[2,2,2,7,1,7,0,0,0,38,7,"F","Nível 2","Nível 2","1.7.",null,null,"COBERTURAS","-",null,null,null,null,""]
[3,3,3,6,1,7,1,0,0,6,9,"F","Nível 3","Nível 3","1.7.1.",null,null,"CERÂMICA","-",null,null,null,null,""]
["S",3,"S",0,1,7,1,0,0,0,0,"F","Serviço","Serviço","1.7.1.0.1.","SINAPI",94445,"TELHAMENTO COM TELHA CERÂMICA CAPA-CANAL, TIPO PLAN, COM ATÉ 2 ÁGUAS, INCLUSO TRANSPORTE VERTICAL. AF_06/2016","M2",400,null,null,null,"Referência: AGETOP - 160401"]
["S",3,"S",0,1,7,1,0,0,0,0,"F","Serviço","Serviço","1.7.1.0.2.","SINAPI",94221,"CUMEEIRA PARA TELHA CERÂMICA EMBOÇADA COM ARGAMASSA TRAÇO 1:2:9 (CIMENTO, CAL E AREIA) PARA TELHADOS COM ATÉ 2 ÁGUAS, INCLUSO TRANSPORTE VERTICAL. AF_06/2016","M",86,null,null,null,""]
["S",3,"S",0,1,7,1,0,0,0,0,"F","Serviço","Serviço","1.7.1.0.3.","SINAPI",94224,"EMBOÇAMENTO COM ARGAMASSA TRAÇO 1:2:9 (CIMENTO, CAL E AREIA). AF_06/2016","M",189,null,null,null,"Referência: AGETOP - 160403"]
["S",3,"S",0,1,7,1,0,0,0,0,"F","Serviço","Serviço","1.7.1.0.4.","SINAPI",94224,"EMBOÇAMENTO COM ARGAMASSA TRAÇO 1:2:9 (CIMENTO, CAL E AREIA). AF_06/2016","M",59,null,null,null,"Referência: AGETOP - 160404"]
["S",3,"S",0,1,7,1,0,0,0,0,"F","Serviço","Serviço","1.7.1.0.5.","AGETOP",160421,"MAO DE OBRA PARA COBERTURA C/TELHA COLONIAL PLAN","m2    ",800,null,null,null,""]
[{"$f":"CHOOSE(1+LOG(1+2*(ORÇAMENTO.Nivel=\"Nível 1\")+4*(ORÇAMENTO.Nivel=\"Nível 2\")+8*(ORÇAMENTO.Nivel=\"Nível 3\")+16*(ORÇAMENTO.Nivel=\"Nível 4\")+32*(ORÇAMENTO.Nivel=\"Serviço\"),2),0,1,2,3,4,\"S\")","v":2},2,2,5,{"$f":"IF($C173=1,OFFSET(E173,-1,0)+1,OFFSET(E173,-1,0))","v":1},{"$f":"IF($C173=1,0,IF($C173=2,OFFSET(F173,-1,0)+1,OFFSET(F173,-1,0)))","v":8},{"$f":"IF(AND($C173<=2,$C173<>0),0,IF($C173=3,OFFSET(G173,-1,0)+1,OFFSET(G173,-1,0)))","v":0},{"$f":"IF(AND($C173<=3,$C173<>0),0,IF($C173=4,OFFSET(H173,-1,0)+1,OFFSET(H173,-1,0)))","v":0},{"$f":"IF(AND($C173<=4,$C173<>0),0,IF(AND($C173=\"S\",$W173>0),OFFSET(I173,-1,0)+1,OFFSET(I173,-1,0)))","v":0},31,5,"F","Nível 2","Nível 2","1.8.",null,null,"FORROS","-",null,null,null,null,""]
[3,3,3,2,1,8,1,0,0,4,2,"F","Nível 3","Nível 3","1.8.1.","SINAPI",null,"PVC SEM ESTRUTURA","-",null,null,null,null,""]
["S",3,"S",0,1,8,1,0,0,0,0,"F","Serviço","Serviço","1.8.1.0.1.","AGETOP",210461,"FORRO DE PVC SEM ESTRUTURA DE METALON (COM REPINTURA DA ESTRUTURA COM TINTA ALQUÍDICA D.F.)","m2    ",296,null,null,null,""]
[3,{"$f":"IF(OR(C176=\"s\",C176=0),OFFSET(B176,-1,0),C176)","v":3},{"$f":"IF(OFFSET(C176,-1,0)=\"L\",1,IF(OFFSET(C176,-1,0)=1,2,IF(OR(A176=\"s\",A176=0),\"S\",IF(AND(OFFSET(C176,-1,0)=2,A176=4),3,IF(AND(OR(OFFSET(C176,-1,0)=\"s\",OFFSET(C176,-1,0)=0),A176<>\"s\",A176>OFFSET(B176,-1,0)),OFFSET(B176,-1,0),A176)))))","v":3},{"$f":"IF(OR(C176=\"S\",C176=0),0,IF(ISERROR(K176),J176,SMALL(J176:K176,1)))","v":2},1,8,2,0,0,2,20,"F","Nível 3","Nível 3","1.8.2.","SINAPI",null,"PVC COM ESTRUTURA","-",null,null,null,null,""]
["S",3,"S",0,1,8,2,0,0,0,0,"F","Serviço","Serviço","1.8.2.0.1.","SINAPI",96116,"FORRO EM RÉGUAS DE PVC, FRISADO, PARA AMBIENTES COMERCIAIS, INCLUSIVE ESTRUTURA DE FIXAÇÃO. AF_05/2017_P","M2",296,null,null,null,"Referência: AGETOP - 210460"]
[2,2,2,5,1,9,0,0,0,26,5,"F","Nível 2","Nível 2","1.9.",null,null,"REVESTIMENTO DE PISO","-",null,null,null,null,""]
[3,3,3,2,1,9,1,0,0,4,2,"F","Nível 3","Nível 3","1.9.1.",null,null,"GRANITINA","-",null,null,null,null,""]
["S",3,"S",0,1,9,1,0,0,0,0,"F","Serviço","Serviço","1.9.1.0.1.","AGETOP",221104,"RASPAGEM E APLICAÇÃO RESINA ACRÍLICA DUAS DEMÃOS","m2    ",750,null,null,null,""]
[3,3,3,2,1,9,2,0,0,2,15,"F","Nível 3","Nível 3","1.9.2.",null,null,"PASSEIO (CALÇADA)","-",null,null,null,null,""]
["S",3,"S",0,1,9,2,0,0,0,0,"F","Serviço","Serviço","1.9.2.0.1.","AGETOP",220100,"PASSEIO PROTECAO EM CONC.DESEMPEN.5 CM 1:2,5:3,5 ( INCLUSO ESPELHO DE 60CM/ESCAVAÇÃO/REATERRO/APILOAMENTO/ATERRO INTERNO)","m2    ",60,null,null,null,""]
[2,2,2,6,1,10,0,0,0,21,6,"F","Nível 2","Nível 2","1.10.",null,null,"ADMINISTRAÇÃO","-",null,null,null,null,""]
[3,3,3,3,1,10,1,0,0,5,3,"F","Nível 3","Nível 3","1.10.1.",null,null,"MENSALISTAS","-",null,null,null,null,""]
["S",3,"S",0,1,10,1,0,0,0,0,"F","Serviço","Serviço","1.10.1.0.1.","SINAPI",90778,"ENGENHEIRO CIVIL DE OBRA PLENO COM ENCARGOS COMPLEMENTARES","H",88,null,null,null,"Referência: AGETOP - 250101"]
["S",3,"S",0,1,10,1,0,0,0,0,"F","Serviço","Serviço","1.10.1.0.2.","SINAPI",90776,"ENCARREGADO GERAL COM ENCARGOS COMPLEMENTARES","H",440,null,null,null,"Referência: AGETOP - 250103"]
[3,3,3,2,1,10,2,0,0,2,9,"F","Nível 3","Nível 3","1.10.2.",null,null,"LAUDO DE ESTANQUEIDADE","-",null,null,null,null,""]
["S",3,"S",0,1,10,2,0,0,0,0,"F","Serviço","Serviço","1.10.2.0.1.","SINAPI",90778,"ENGENHEIRO CIVIL DE OBRA PLENO COM ENCARGOS COMPLEMENTARES","H",16,null,null,null,"Referência: AGETOP - 250101"]
[2,2,2,13,1,11,0,0,0,15,13,"F","Nível 2","Nível 2","1.11.",null,null,"PINTURA","-",null,null,null,null,""]
[3,3,3,4,1,11,1,0,0,12,4,"F","Nível 3","Nível 3","1.11.1.",null,null,"ESMALTE SINTÉTICO","-",null,null,null,null,""]
["S",3,"S",0,1,11,1,0,0,0,0,"F","Serviço","Serviço","1.11.1.0.1.","AGETOP",260105,"REMOCAO DE PINTURA ANTIGA A OLEO OU ESMALTE","m2    ",235,null,null,null,""]
["S",3,"S",0,1,11,1,0,0,0,0,"F","Serviço","Serviço","1.11.1.0.2.","SINAPI",88497,"APLICAÇÃO E LIXAMENTO DE MASSA LÁTEX EM PAREDES, DUAS DEMÃOS. AF_06/2014","M2",235,null,null,null,"Referência: AGETOP - 261300"]
[{"$f":"CHOOSE(1+LOG(1+2*(ORÇAMENTO.Nivel=\"Nível 1\")+4*(ORÇAMENTO.Nivel=\"Nível 2\")+8*(ORÇAMENTO.Nivel=\"Nível 3\")+16*(ORÇAMENTO.Nivel=\"Nível 4\")+32*(ORÇAMENTO.Nivel=\"Serviço\"),2),0,1,2,3,4,\"S\")","v":"S"},3,"S",0,1,11,1,0,{"$f":"IF(AND($C193<=4,$C193<>0),0,IF(AND($C193=\"S\",$W193>0),OFFSET(I193,-1,0)+1,OFFSET(I193,-1,0)))","v":0},0,0,"F","Serviço","Serviço","1.11.1.0.3.","AGETOP",261550,"PINT.ESMALTE SINT.PAREDES - 2 DEM.C/SELADOR","m2    ",1015,null,null,null,""]
[3,3,3,2,1,11,2,0,0,8,2,"F","Nível 3","Nível 3","1.11.2.","AGETOP",null,"LÁTEX ACRÍLICA","-",null,null,null,null,""]
["S",3,"S",0,{"$f":"IF($C195=1,OFFSET(E195,-1,0)+1,OFFSET(E195,-1,0))","v":1},{"$f":"IF($C195=1,0,IF($C195=2,OFFSET(F195,-1,0)+1,OFFSET(F195,-1,0)))","v":11},{"$f":"IF(AND($C195<=2,$C195<>0),0,IF($C195=3,OFFSET(G195,-1,0)+1,OFFSET(G195,-1,0)))","v":2},{"$f":"IF(AND($C195<=3,$C195<>0),0,IF($C195=4,OFFSET(H195,-1,0)+1,OFFSET(H195,-1,0)))","v":0},0,0,0,"F","Serviço","Serviço","1.11.2.0.1.","SINAPI",88489,"APLICAÇÃO MANUAL DE PINTURA COM TINTA LÁTEX ACRÍLICA EM PAREDES, DUAS DEMÃOS. AF_06/2014","M2",1015,null,null,null,"Referência: AGETOP - 261001"]
[3,3,3,2,1,11,3,0,0,6,2,"F","Nível 3","Nível 3","1.11.3.","AGETOP",null,"EXTERNA","-",null,null,null,null,""]
["S",{"$f":"IF(OR(C197=\"s\",C197=0),OFFSET(B197,-1,0),C197)","v":3},{"$f":"IF(OFFSET(C197,-1,0)=\"L\",1,IF(OFFSET(C197,-1,0)=1,2,IF(OR(A197=\"s\",A197=0),\"S\",IF(AND(OFFSET(C197,-1,0)=2,A197=4),3,IF(AND(OR(OFFSET(C197,-1,0)=\"s\",OFFSET(C197,-1,0)=0),A197<>\"s\",A197>OFFSET(B197,-1,0)),OFFSET(B197,-1,0),A197)))))","v":"S"},{"$f":"IF(OR(C197=\"S\",C197=0),0,IF(ISERROR(K197),J197,SMALL(J197:K197,1)))","v":0},1,11,3,0,0,0,0,"F","Serviço","Serviço","1.11.3.0.1.","AGETOP",260202,"CAIACAO DUAS DEMAOS MUROS E PAREDES - (OB.C.)","m2    ",440,null,null,null,""]
[3,3,3,2,1,11,4,0,0,4,2,"F","Nível 3","Nível 3","1.11.4.","AGETOP",null,"ESQUADRIAS EXISTENTES","-",null,null,null,null,""]
["S",3,"S",0,1,11,4,0,0,0,0,"F","Serviço","Serviço","1.11.4.0.1.","SINAPI","73924/3","PINTURA ESMALTE FOSCO, DUAS DEMAOS, SOBRE SUPERFICIE METALICA","M2",275,null,null,null,"Referência: AGETOP - 261503"]
[3,3,3,2,1,11,5,0,0,2,{"$error":"#N/A"},"F","Nível 3","Nível 3","1.11.5.","AGETOP",null,"OUTROS","-",null,null,null,null,""]
["S",3,"S",0,1,11,5,0,0,0,0,"F","Serviço","Serviço","1.11.5.0.1.","AGETOP",261620,"LETREIRO MÉDIO A GRANDE PORTE EM PAREDE FEITO A PINCEL","m2    ",7.2,null,null,null,""]
[2,2,2,2,1,12,0,0,0,2,178,"F","Nível 2","Nível 2","1.12.",null,null,"DIVERSOS","-",null,null,null,null,""]
["S",2,"S",0,1,12,0,0,0,0,0,"F","Serviço","Serviço","1.12.0.0.1.","COMPOSIÇÃO","COMP 402_SEE","QD.GIZ EMBOCO/LAM.MELAMINICO COMPL.-ESC.2000 4,2X1,20M","M2",35,null,null,null,""]
[1,1,1,6,2,0,0,0,0,371,6,"F","Nível 1","Nível 1","2.","SINAPI",null,"ACESSIBILIDADE","-",null,null,null,null,""]
[2,2,2,2,2,1,0,0,0,5,2,"F","Nível 2","Nível 2","2.1.","SINAPI",null,"SERVIÇOS PRELIMINARES","-",null,null,null,null,""]
["S",2,"S",0,2,1,0,0,0,0,0,"F","Serviço","Serviço","2.1.0.0.1.","AGETOP",20121,"DEM. MANUAL EM CONCR.SIMPLES C/TR.ATE CB.E CARGA (O.C.)","m3    ",3.0500000000000003,null,null,null,""]
[2,2,2,3,2,2,0,0,0,3,15,"F","Nível 2","Nível 2","2.2.","SINAPI",null,"REVESTIMENTO DE PISO","-",null,null,null,null,""]
[3,3,3,2,2,2,1,0,0,2,196,"F","Nível 3","Nível 3","2.2.1.","SINAPI",null,"PODOTATIL","-",null,null,null,null,""]
["S",3,"S",0,2,2,1,0,0,0,0,"F","Serviço","Serviço","2.2.1.0.1.","AGETOP",221126,"PISO DE LADRILHO HIDRÁULICO COLORIDO MODELO TÁTIL ( ALERTA OU DIRECIONAL) SEM LASTRO","m2    ",62,null,null,null,""]
[1,1,1,25,3,0,0,0,0,365,25,"F","Nível 1","Nível 1","3.","SINAPI",null,"IMPLANTAÇÃO","-",null,null,null,null,""]
[2,2,2,4,3,1,0,0,0,{"$f":"IF(OR($C211=\"S\",$C211=0),0,MATCH(0,OFFSET($D211,1,$C211,ROW($C$575)-ROW($C211)),0))","v":24},{"$f":"IF(OR($C211=\"S\",$C211=0),0,MATCH(OFFSET($D211,0,$C211)+1,OFFSET($D211,1,$C211,ROW($C$575)-ROW($C211)),0))","v":4},"F","Nível 2","Nível 2","3.1.","SINAPI",null,"SERVIÇOS PRELIMINARES","-",null,null,null,null,""]
["S",2,"S",0,3,1,0,0,0,0,0,"F","Serviço","Serviço","3.1.0.0.1.","AGETOP",20107,"CORTE/DESTOC./RETIRADA/REATERRO (MANUAIS) DE ÁRVORE GRANDE PORTE ( H = 8 A 10 M / DIÂMETRO TRONCO 60 A 70CM E COPA DE 10 A 13M ) C/TRANSP.ATE C.B.E CARGA ","Un    ",3,null,null,null,""]
["S",2,"S",0,3,1,0,0,0,0,0,"F","Serviço","Serviço","3.1.0.0.2.","SINAPI","73859/2","CAPINA E LIMPEZA MANUAL DE TERRENO","M2",312,null,null,null,""]
["S",2,"S",0,3,1,0,0,0,0,0,"F","Serviço","Serviço","3.1.0.0.3.","SINAPI",97622,"DEMOLIÇÃO DE ALVENARIA DE BLOCO FURADO, DE FORMA MANUAL, SEM REAPROVEITAMENTO. AF_12/2017","M3",3.15,null,null,null,"Referência: AGETOP - 20118"]
[2,2,2,7,3,2,0,0,0,20,7,"F","Nível 2","Nível 2","3.2.","SINAPI",null,"SERVIÇO EM TERRA","-",null,null,null,null,""]
["S",2,"S",0,3,2,0,0,0,0,0,"F","Serviço","Serviço","3.2.0.0.1.","SINAPI",79480,"ESCAVACAO MECANICA CAMPO ABERTO EM SOLO EXCETO ROCHA ATE 2,00M PROFUNDIDADE","M3",143.75,null,null,null,"Referência: AGETOP - 41004"]
["S",2,"S",0,3,2,0,0,0,0,0,"F","Serviço","Serviço","3.2.0.0.2.","SINAPI",72898,"CARGA E DESCARGA MECANIZADAS DE ENTULHO EM CAMINHAO BASCULANTE 6 M3","M3",143.75,null,null,null,"Referência: AGETOP - 41005"]
["S",2,"S",0,3,2,0,0,0,0,0,"F","Serviço","Serviço","3.2.0.0.3.","AGETOP",41012,"INDENIZAÇÃO DE JAZIDA","m3    ",143.75,null,null,null,""]
["S",2,"S",0,3,2,0,0,0,0,0,"F","Serviço","Serviço","3.2.0.0.4.","AGETOP",41006,"TRANSPORTE DE MATERIAL ESCAVADO M3.KM","m3km  ",1437.5,null,null,null,""]
["S",2,"S",0,3,2,0,0,0,0,0,"F","Serviço","Serviço","3.2.0.0.5.","SINAPI","74005/1","COMPACTACAO MECANICA, SEM CONTROLE DO GC (C/COMPACTADOR PLACA 400 KG)","M3",115,null,null,null,"Referência: AGETOP - 41009"]
["S",2,"S",0,3,2,0,0,0,0,0,"F","Serviço","Serviço","3.2.0.0.6.","AGETOP",41140,"REGULARIZAÇÃO DO TERRENO SEM APILOAMENTO COM TRANSPORTE MANUAL DA TERRA ESCAVADA ","m2    ",312,null,null,null,""]
[2,2,2,8,3,3,0,0,0,13,8,"F","Nível 2","Nível 2","3.3.","AGETOP",null,"INSTALAÇÕES ELÉTRICAS","-",null,null,null,null,""]
["S",2,"S",0,3,3,0,0,0,0,0,"F","Serviço","Serviço","3.3.0.0.1.","SINAPI","74131/5","QUADRO DE DISTRIBUICAO DE ENERGIA DE EMBUTIR, EM CHAPA METALICA, PARA 24 DISJUNTORES TERMOMAGNETICOS MONOPOLARES, COM BARRAMENTO TRIFASICO E NEUTRO, FORNECIMENTO E INSTALACAO","UN",2,null,null,null,""]
["S",2,"S",0,3,3,0,0,0,0,0,"F","Serviço","Serviço","3.3.0.0.2.","SINAPI",93673,"DISJUNTOR TRIPOLAR TIPO DIN, CORRENTE NOMINAL DE 50A - FORNECIMENTO E INSTALAÇÃO. AF_04/2016","UN",1,null,null,null,"Referência: AGETOP - 71174"]
["S",2,"S",0,3,3,0,0,0,0,0,"F","Serviço","Serviço","3.3.0.0.3.","SINAPI",93673,"DISJUNTOR TRIPOLAR TIPO DIN, CORRENTE NOMINAL DE 50A - FORNECIMENTO E INSTALAÇÃO. AF_04/2016","UN",1,null,null,null,"Referência: AGETOP - 71174"]
["S",2,"S",0,3,3,0,0,0,0,0,"F","Serviço","Serviço","3.3.0.0.4.","SINAPI",92980,"CABO DE COBRE FLEXÍVEL ISOLADO, 10 MM², ANTI-CHAMA 0,6/1,0 KV, PARA DISTRIBUIÇÃO - FORNECIMENTO E INSTALAÇÃO. AF_12/2015","M",150,null,null,null,""]
["S",2,"S",0,3,3,0,0,0,0,0,"F","Serviço","Serviço","3.3.0.0.5.","SINAPI",91931,"CABO DE COBRE FLEXÍVEL ISOLADO, 6 MM², ANTI-CHAMA 0,6/1,0 KV, PARA CIRCUITOS TERMINAIS - FORNECIMENTO E INSTALAÇÃO. AF_12/2015","M",225,null,null,null,"Referência: AGETOP - 70583"]
["S",2,"S",0,3,3,0,0,0,0,0,"F","Serviço","Serviço","3.3.0.0.6.","SINAPI",93009,"ELETRODUTO RÍGIDO ROSCÁVEL, PVC, DN 60 MM (2\") - FORNECIMENTO E INSTALAÇÃO. AF_12/2015","M",25,null,null,null,""]
["S",2,"S",0,3,3,0,0,0,0,0,"F","Serviço","Serviço","3.3.0.0.7.","SINAPI",93008,"ELETRODUTO RÍGIDO ROSCÁVEL, PVC, DN 50 MM (1 1/2\") - FORNECIMENTO E INSTALAÇÃO. AF_12/2015","M",30,null,null,null,""]
[2,2,2,2,3,4,0,0,0,5,2,"F","Nível 2","Nível 2","3.4.","SINAPI",null,"COBERTURAS","-",null,null,null,null,""]
["S",2,"S",0,3,4,0,0,0,0,0,"F","Serviço","Serviço","3.4.0.0.1.","SINAPI",94228,"CALHA EM CHAPA DE AÇO GALVANIZADO NÚMERO 24, DESENVOLVIMENTO DE 50 CM, INCLUSO TRANSPORTE VERTICAL. AF_06/2016","M",16.399999999999999,null,null,null,"Referência: AGETOP - 160601"]
[2,2,2,3,3,5,0,0,0,3,26,"F","Nível 2","Nível 2","3.5.","SINAPI",null,"REVESTIMENTO DE PISO","-",null,null,null,null,""]
[3,3,3,2,3,5,1,0,0,2,171,"F","Nível 3","Nível 3","3.5.1.","SINAPI",null,"CONCRETO","-",null,null,null,null,""]
["S",3,"S",0,3,5,1,0,0,0,0,"F","Serviço","Serviço","3.5.1.0.1.","AGETOP",220102,"PISO CONCRETO DESEMPENADO ESPESSURA = 5 CM  1:2,5:3,5","m2    ",57,null,null,null,""]
[1,1,1,181,4,0,0,0,0,340,181,"F","Nível 1","Nível 1","4.","SINAPI",null,"COZINHA SEDUC OPÇÃO 2","-",null,null,null,null,""]
[2,2,2,2,4,1,0,0,0,180,2,"F","Nível 2","Nível 2","4.1.","SINAPI",null,"SERVIÇOS PRELIMINARES","-",null,null,null,null,""]
["S",2,"S",0,4,1,0,0,0,0,0,"F","Serviço","Serviço","4.1.0.0.1.","AGETOP",20701,"LOCAÇÃO DA OBRA, EXECUÇÃO DE GABARITO SEM REAPROVEITAMENTO, INCLUSO PINTURA (FACE INTERNA DO RIPÃO 15CM) E PIQUETE COM TESTEMUNHA","m2    ",56.76,null,null,null,""]
[2,2,2,2,4,2,0,0,0,178,2,"F","Nível 2","Nível 2","4.2.","AGETOP",null,"TRANSPORTES","-",null,null,null,null,""]
["S",2,"S",0,4,2,0,0,0,0,0,"F","Serviço","Serviço","4.2.0.0.1.","SINAPI",72900,"TRANSPORTE DE ENTULHO COM CAMINHAO BASCULANTE 6 M3, RODOVIA PAVIMENTADA, DMT 0,5 A 1,0 KM","M3",7,null,null,null,""]
[2,2,2,3,4,3,0,0,0,176,3,"F","Nível 2","Nível 2","4.3.","AGETOP",null,"SERVIÇO EM TERRA","-",null,null,null,null,""]
["S",2,"S",0,4,3,0,0,0,0,0,"F","Serviço","Serviço","4.3.0.0.1.","SINAPI",79480,"ESCAVACAO MECANICA CAMPO ABERTO EM SOLO EXCETO ROCHA ATE 2,00M PROFUNDIDADE","M3",139.75,null,null,null,"Referência: AGETOP - 41004"]
["S",2,"S",0,4,3,0,0,0,0,0,"F","Serviço","Serviço","4.3.0.0.2.","AGETOP",41002,"APILOAMENTO","m2    ",140.75,null,null,null,""]
[2,2,2,5,4,4,0,0,0,173,5,"F","Nível 2","Nível 2","4.4.","AGETOP",null,"FUNDAÇÕES E SONDAGENS","-",null,null,null,null,""]
["S",2,"S",0,4,4,0,0,0,0,0,"F","Serviço","Serviço","4.4.0.0.1.","AGETOP",50901,"ESCAVACAO MANUAL DE VALAS (SAPATAS/BLOCOS)","m3    ",5,null,null,null,""]
["S",2,"S",0,4,4,0,0,0,0,0,"F","Serviço","Serviço","4.4.0.0.2.","SINAPI",94970,"CONCRETO FCK = 20MPA, TRAÇO 1:2,7:3 (CIMENTO/ AREIA MÉDIA/ BRITA 1)  - PREPARO MECÂNICO COM BETONEIRA 600 L. AF_07/2016","M3",1.92,null,null,null,""]
["S",2,"S",0,4,4,0,0,0,0,0,"F","Serviço","Serviço","4.4.0.0.3.","SINAPI","74157/4","LANCAMENTO/APLICACAO MANUAL DE CONCRETO EM FUNDACOES","M3",1.92,null,null,null,"Referência: AGETOP - 51026"]
["S",2,"S",0,4,4,0,0,0,0,0,"F","Serviço","Serviço","4.4.0.0.4.","SINAPI",96545,"ARMAÇÃO DE BLOCO, VIGA BALDRAME OU SAPATA UTILIZANDO AÇO CA-50 DE 8 MM - MONTAGEM. AF_06/2017","KG",67,null,null,null,"Referência: AGETOP - 52004"]
[2,2,2,10,4,5,0,0,0,168,10,"F","Nível 2","Nível 2","4.5.","AGETOP",null,"ESTRUTURA","-",null,null,null,null,""]
["S",2,"S",0,4,5,0,0,0,0,0,"F","Serviço","Serviço","4.5.0.0.1.","SINAPI",92426,"MONTAGEM E DESMONTAGEM DE FÔRMA DE PILARES RETANGULARES E ESTRUTURAS SIMILARES COM ÁREA MÉDIA DAS SEÇÕES MENOR OU IGUAL A 0,25 M², PÉ-DIREITO SIMPLES, EM CHAPA DE MADEIRA COMPENSADA RESINADA, 8 UTILIZAÇÕES. AF_12/2015","M2",92.24,null,null,null,""]
["S",2,"S",0,4,5,0,0,0,0,0,"F","Serviço","Serviço","4.5.0.0.2.","AGETOP",60191,"FORMA DE TABUA CINTA BALDRAME U=8 VEZES","m2    ",51.56,null,null,null,""]
["S",2,"S",0,4,5,0,0,0,0,0,"F","Serviço","Serviço","4.5.0.0.3.","AGETOP",61101,"FORRO EM LAJE PRE-MOLDADA INC.CAPEAMENTO/FERR.DISTRIB./ESCORAMENTO E FORMA/DESFORMA","m2    ",40.75,null,null,null,""]
["S",2,"S",0,4,5,0,0,0,0,0,"F","Serviço","Serviço","4.5.0.0.4.","SINAPI",94964,"CONCRETO FCK = 20MPA, TRAÇO 1:2,7:3 (CIMENTO/ AREIA MÉDIA/ BRITA 1)  - PREPARO MECÂNICO COM BETONEIRA 400 L. AF_07/2016","M3",4.51,null,null,null,""]
["S",2,"S",0,4,5,0,0,0,0,0,"F","Serviço","Serviço","4.5.0.0.5.","SINAPI",92873,"LANÇAMENTO COM USO DE BALDES, ADENSAMENTO E ACABAMENTO DE CONCRETO EM ESTRUTURAS. AF_12/2015","M3",4.51,null,null,null,"Referência: AGETOP - 60801"]
["S",2,"S",0,4,5,0,0,0,0,0,"F","Serviço","Serviço","4.5.0.0.6.","SINAPI",92777,"ARMAÇÃO DE PILAR OU VIGA DE UMA ESTRUTURA CONVENCIONAL DE CONCRETO ARMADO EM UMA EDIFICAÇÃO TÉRREA OU SOBRADO UTILIZANDO AÇO CA-50 DE 8,0 MM - MONTAGEM. AF_12/2015","KG",68.5,null,null,null,"Referência: AGETOP - 60304"]
["S",2,"S",0,4,5,0,0,0,0,0,"F","Serviço","Serviço","4.5.0.0.7.","SINAPI",92778,"ARMAÇÃO DE PILAR OU VIGA DE UMA ESTRUTURA CONVENCIONAL DE CONCRETO ARMADO EM UMA EDIFICAÇÃO TÉRREA OU SOBRADO UTILIZANDO AÇO CA-50 DE 10,0 MM - MONTAGEM. AF_12/2015","KG",305.8,null,null,null,"Referência: AGETOP - 60305"]
["S",2,"S",0,4,5,0,0,0,0,0,"F","Serviço","Serviço","4.5.0.0.8.","SINAPI",92779,"ARMAÇÃO DE PILAR OU VIGA DE UMA ESTRUTURA CONVENCIONAL DE CONCRETO ARMADO EM UMA EDIFICAÇÃO TÉRREA OU SOBRADO UTILIZANDO AÇO CA-50 DE 12,5 MM - MONTAGEM. AF_12/2015","KG",16.3,null,null,null,"Referência: AGETOP - 60306"]
["S",2,"S",0,4,5,0,0,0,0,0,"F","Serviço","Serviço","4.5.0.0.9.","SINAPI",92775,"ARMAÇÃO DE PILAR OU VIGA DE UMA ESTRUTURA CONVENCIONAL DE CONCRETO ARMADO EM UMA EDIFICAÇÃO TÉRREA OU SOBRADO UTILIZANDO AÇO CA-60 DE 5,0 MM - MONTAGEM. AF_12/2015","KG",116.2,null,null,null,"Referência: AGETOP - 60314"]
[2,2,2,26,4,6,0,0,0,158,26,"F","Nível 2","Nível 2","4.6.",null,null,"INSTALAÇÕES ELÉTRICAS","-",null,null,null,null,""]
["S",2,"S",0,4,6,0,0,0,0,0,"F","Serviço","Serviço","4.6.0.0.1.","AGETOP",70421,"BUCHA E ARRUELA METALICA DIAM. 3/4\"","PR    ",3,null,null,null,""]
["S",2,"S",0,4,6,0,0,0,0,0,"F","Serviço","Serviço","4.6.0.0.2.","AGETOP",70580,"CABO PVC (70ºC) 1 KV No 1,5 MM2","M     ",108.2,null,null,null,""]
["S",2,"S",0,4,6,0,0,0,0,0,"F","Serviço","Serviço","4.6.0.0.3.","AGETOP",70581,"CABO PVC (70ºC) 1 KV No. 2,5 MM2","M     ",356.5,null,null,null,""]
["S",2,"S",0,4,6,0,0,0,0,0,"F","Serviço","Serviço","4.6.0.0.4.","AGETOP",70583,"CABO PVC (70ºC) 1 KV No. 6 MM2","M     ",60.8,null,null,null,""]
["S",2,"S",0,4,6,0,0,0,0,0,"F","Serviço","Serviço","4.6.0.0.5.","SINAPI",92866,"CAIXA SEXTAVADA 3\" X 3\", METÁLICA, INSTALADA EM LAJE - FORNECIMENTO E INSTALAÇÃO. AF_12/2015","UN",10,null,null,null,"Referência: AGETOP - 70680"]
["S",2,"S",0,4,6,0,0,0,0,0,"F","Serviço","Serviço","4.6.0.0.6.","SINAPI",92868,"CAIXA RETANGULAR 4\" X 2\" MÉDIA (1,30 M DO PISO), METÁLICA, INSTALADA EM PAREDE - FORNECIMENTO E INSTALAÇÃO. AF_12/2015","UN",26,null,null,null,"Referência: AGETOP - 70691"]
["S",2,"S",0,4,6,0,0,0,0,0,"F","Serviço","Serviço","4.6.0.0.7.","SINAPI",91902,"CURVA 90 GRAUS PARA ELETRODUTO, PVC, ROSCÁVEL, DN 25 MM (3/4\"), PARA CIRCUITOS TERMINAIS, INSTALADA EM LAJE - FORNECIMENTO E INSTALAÇÃO. AF_12/2015","UN",1,null,null,null,"Referência: AGETOP - 71141"]
["S",2,"S",0,4,6,0,0,0,0,0,"F","Serviço","Serviço","4.6.0.0.8.","SINAPI",93653,"DISJUNTOR MONOPOLAR TIPO DIN, CORRENTE NOMINAL DE 10A - FORNECIMENTO E INSTALAÇÃO. AF_04/2016","UN",12,null,null,null,""]
["S",2,"S",0,4,6,0,0,0,0,0,"F","Serviço","Serviço","4.6.0.0.9.","SINAPI",93654,"DISJUNTOR MONOPOLAR TIPO DIN, CORRENTE NOMINAL DE 16A - FORNECIMENTO E INSTALAÇÃO. AF_04/2016","UN",1,null,null,null,""]
["S",2,"S",0,4,6,0,0,0,0,0,"F","Serviço","Serviço","4.6.0.0.10.","AGETOP",71450,"INTERRUPTOR DIFERENCIAL RESIDUAL (D.R.) BIPOLAR DE 25A-30mA","Un    ",12,null,null,null,""]
["S",2,"S",0,4,6,0,0,0,0,0,"F","Serviço","Serviço","4.6.0.0.11.","SINAPI",91844,"ELETRODUTO FLEXÍVEL CORRUGADO, PVC, DN 25 MM (3/4\"), PARA CIRCUITOS TERMINAIS, INSTALADO EM LAJE - FORNECIMENTO E INSTALAÇÃO. AF_12/2015","M",40,null,null,null,""]
["S",2,"S",0,4,6,0,0,0,0,0,"F","Serviço","Serviço","4.6.0.0.12.","SINAPI",91846,"ELETRODUTO FLEXÍVEL CORRUGADO, PVC, DN 32 MM (1\"), PARA CIRCUITOS TERMINAIS, INSTALADO EM LAJE - FORNECIMENTO E INSTALAÇÃO. AF_12/2015","M",10.1,null,null,null,""]
["S",2,"S",0,4,6,0,0,0,0,0,"F","Serviço","Serviço","4.6.0.0.13.","AGETOP",71197,"ELETRODUTO PVC FLEXÍVEL - MANGUEIRA CORRUGADA REFORÇADA - DIAM. 50MM","M     ",31.1,null,null,null,""]
["S",2,"S",0,4,6,0,0,0,0,0,"F","Serviço","Serviço","4.6.0.0.14.","SINAPI",97617,"LÂMPADA TUBULAR FLUORESCENTE T10 DE 20/40 W, BASE G13 - FORNECIMENTO E INSTALAÇÃO. AF_11/2017_P","UN",1,null,null,null,""]
["S",2,"S",0,4,6,0,0,0,0,0,"F","Serviço","Serviço","4.6.0.0.15.","SINAPI",83392,"REATOR PARA LAMPADA FLUORESCENTE 1X20W PARTIDA RAPIDA FORNECIMENTO E INSTALACAO","UN",4,null,null,null,""]
["S",2,"S",0,4,6,0,0,0,0,0,"F","Serviço","Serviço","4.6.0.0.16.","SINAPI",83393,"REATOR PARA LAMPADA FLUORESCENTE 1X40W PARTIDA RAPIDA FORNECIMENTO E INSTALACAO","UN",2,null,null,null,""]
["S",2,"S",0,4,6,0,0,0,{"$f":"IF(OR($C275=\"S\",$C275=0),0,MATCH(0,OFFSET($D275,1,$C275,ROW($C$575)-ROW($C275)),0))","v":0},{"$f":"IF(OR($C275=\"S\",$C275=0),0,MATCH(OFFSET($D275,0,$C275)+1,OFFSET($D275,1,$C275,ROW($C$575)-ROW($C275)),0))","v":0},"F","Serviço","Serviço","4.6.0.0.17.","AGETOP",72341,"SOQUETE ANTIVIBRATORIO P/LAMP.FLUORESCENTE","Un    ",34,null,null,null,""]
["S",2,"S",0,4,6,0,0,0,0,0,"F","Serviço","Serviço","4.6.0.0.18.","SINAPI",91955,"INTERRUPTOR PARALELO (1 MÓDULO), 10A/250V, INCLUINDO SUPORTE E PLACA - FORNECIMENTO E INSTALAÇÃO. AF_12/2015","UN",2,null,null,null,"Referência: AGETOP - 71431"]
["S",2,"S",0,4,6,0,0,0,0,0,"F","Serviço","Serviço","4.6.0.0.19.","SINAPI",91953,"INTERRUPTOR SIMPLES (1 MÓDULO), 10A/250V, INCLUINDO SUPORTE E PLACA - FORNECIMENTO E INSTALAÇÃO. AF_12/2015","UN",5,null,null,null,"Referência: AGETOP - 71440"]
["S",2,"S",0,4,6,0,0,0,0,0,"F","Serviço","Serviço","4.6.0.0.20.","SINAPI",91959,"INTERRUPTOR SIMPLES (2 MÓDULOS), 10A/250V, INCLUINDO SUPORTE E PLACA - FORNECIMENTO E INSTALAÇÃO. AF_12/2015","UN",1,null,null,null,"Referência: AGETOP - 71441"]
["S",2,"S",0,4,6,0,0,0,0,0,"F","Serviço","Serviço","4.6.0.0.21.","AGETOP",71380,"HASTE REV.COBRE(COPPERWELD)  3/4\" X 2,40 M C/CONECTOR","Un    ",3,null,null,null,""]
["S",2,"S",0,4,6,0,0,0,0,0,"F","Serviço","Serviço","4.6.0.0.22.","SINAPI",97611,"LÂMPADA COMPACTA FLUORESCENTE DE 15 W, BASE E27 - FORNECIMENTO E INSTALAÇÃO. AF_11/2017","UN",1,null,null,null,"Referência: AGETOP - 71567"]
["S",2,"S",0,4,6,0,0,0,0,0,"F","Serviço","Serviço","4.6.0.0.23.","AGETOP",72190,"QUADRO DE DISTRIBUIÇÃO DE EMBUTIR METÁLICO CB-24E - 150A","Un    ",1,null,null,null,""]
["S",2,"S",0,4,6,0,0,0,0,0,"F","Serviço","Serviço","4.6.0.0.24.","SINAPI",91884,"LUVA PARA ELETRODUTO, PVC, ROSCÁVEL, DN 25 MM (3/4\"), PARA CIRCUITOS TERMINAIS, INSTALADA EM PAREDE - FORNECIMENTO E INSTALAÇÃO. AF_12/2015","UN",3,null,null,null,"Referência: AGETOP - 71741"]
["S",2,"S",0,4,6,0,0,0,0,0,"F","Serviço","Serviço","4.6.0.0.25.","SINAPI",91996,"TOMADA MÉDIA DE EMBUTIR (1 MÓDULO), 2P+T 10 A, INCLUINDO SUPORTE E PLACA - FORNECIMENTO E INSTALAÇÃO. AF_12/2015","UN",17,null,null,null,"Referência: AGETOP - 72578"]
[2,2,2,57,4,7,0,0,0,132,57,"F","Nível 2","Nível 2","4.7.","AGETOP",null,"INSTALAÇÕES HIDROSSANITÁRIAS","-",null,null,null,null,""]
[3,3,3,56,4,7,1,0,0,56,119,"F","Nível 3","Nível 3","4.7.1.","SINAPI",null,"PEÇAS E ACESSÓRIOS","-",null,null,null,null,""]
["S",3,"S",0,4,7,1,0,0,0,0,"F","Serviço","Serviço","4.7.1.0.1.","AGETOP",81825,"CAIXA DE PASSAGEM 60 X 60 CM SEM TAMPA","Un    ",5,null,null,null,""]
["S",3,"S",0,4,7,1,0,0,0,0,"F","Serviço","Serviço","4.7.1.0.2.","AGETOP",81826,"TAMPA EM CONCRETO ARMADO 25 MPA E=5CM PARA A CAIXA DE PASSAGEM 60X60CM","Un    ",5,null,null,null,""]
["S",3,"S",0,4,7,1,0,0,0,0,"F","Serviço","Serviço","4.7.1.0.3.","AGETOP",80510,"ANEL DE VEDAÇÃO PARA VASO SANITÁRIO","Un    ",1,null,null,null,""]
["S",3,"S",0,4,7,1,0,0,0,0,"F","Serviço","Serviço","4.7.1.0.4.","AGETOP",80512,"TUBO DE DESCIDA PARA CAIXA DE DESCARGA ( LONGO 1 1/4\" )","Un    ",1,null,null,null,""]
["S",3,"S",0,4,7,1,0,0,0,0,"F","Serviço","Serviço","4.7.1.0.5.","AGETOP",80514,"TUBO DE LIGACAO PVC CROMADO 1.1/2\" / ESPUDE  - (ENTRADA)","Un    ",1,null,null,null,""]
["S",3,"S",0,4,7,1,0,0,0,0,"F","Serviço","Serviço","4.7.1.0.6.","AGETOP",80515,"VÁLVULA DE DESCARGA DUPLO ACIONAMENTO COM ACABAMENTO CROMADO ","Un    ",14,null,null,null,""]
["S",3,"S",0,4,7,1,0,0,0,0,"F","Serviço","Serviço","4.7.1.0.7.","AGETOP",80520,"CONJUNTO DE FIXACAO P/VASO SANITARIO (PAR)","CJ    ",1,null,null,null,""]
["S",3,"S",0,4,7,1,0,0,0,0,"F","Serviço","Serviço","4.7.1.0.8.","AGETOP",80532,"PORTA PAPEL HIGIÊNICO EM METAL/ACABAMENTO CROMADO","Un    ",1,null,null,null,""]
["S",3,"S",0,4,7,1,0,0,0,0,"F","Serviço","Serviço","4.7.1.0.9.","AGETOP",80542,"LAVATÓRIO MÉDIO SEM COLUNA","Un    ",1,null,null,null,""]
["S",3,"S",0,4,7,1,0,0,0,0,"F","Serviço","Serviço","4.7.1.0.10.","AGETOP",80550,"FIXACAO P/LAVATORIO (PAR)","PAR   ",1,null,null,null,""]
["S",3,"S",0,4,7,1,0,0,0,0,"F","Serviço","Serviço","4.7.1.0.11.","AGETOP",80556,"LIGAÇÃO FLEXÍVEL PVC DIAM.1/2\" (ENGATE)","Un    ",1,null,null,null,""]
["S",3,"S",0,4,7,1,0,0,0,0,"F","Serviço","Serviço","4.7.1.0.12.","AGETOP",80562,"SIFAO FLEXIVEL UNIVERSAL ( SANFONADO) EM PVC PARA LAVATORIO","Un    ",1,null,null,null,""]
["S",3,"S",0,4,7,1,0,0,0,0,"F","Serviço","Serviço","4.7.1.0.13.","AGETOP",80570,"TORNEIRA DE MESA PARA LAVATÓRIO DIÂMETRO DE 1/2\"","Un    ",4,null,null,null,""]
["S",3,"S",0,4,7,1,0,0,0,0,"F","Serviço","Serviço","4.7.1.0.14.","AGETOP",80580,"VALVULA P/LAVATORIO OU BEBEDOURO METALICO DIAMETRO 1\"","Un    ",1,null,null,null,""]
["S",3,"S",0,4,7,1,0,0,0,0,"F","Serviço","Serviço","4.7.1.0.15.","SINAPI",86911,"TORNEIRA CROMADA LONGA, DE PAREDE, 1/2\" OU 3/4\", PARA PIA DE COZINHA, PADRÃO POPULAR - FORNECIMENTO E INSTALAÇÃO. AF_12/2013","UN",5,null,null,null,""]
["S",3,"S",0,4,7,1,0,0,0,0,"F","Serviço","Serviço","4.7.1.0.16.","AGETOP",80671,"SIFAO PVC P/PIA 1.1/2\" X 2\"","Un    ",5,null,null,null,""]
["S",3,"S",0,4,7,1,0,0,0,0,"F","Serviço","Serviço","4.7.1.0.17.","AGETOP",80680,"VALVULA P/PIA TIPO AMERICANA DIAM.3.1/2\" (METAL)","Un    ",5,null,null,null,""]
["S",3,"S",0,4,7,1,0,0,0,0,"F","Serviço","Serviço","4.7.1.0.18.","AGETOP",80687,"CUBA INOX 35X40X15CM E=0,6MM-AÇO 304 (CUBA Nº 3)","Un    ",4,null,null,null,""]
["S",3,"S",0,4,7,1,0,0,0,0,"F","Serviço","Serviço","4.7.1.0.19.","AGETOP",80693,"TANQUE (PANELAO) INOX 60 X 70 X 40 CM CH.18","Un    ",1,null,null,null,""]
["S",3,"S",0,4,7,1,0,0,0,0,"F","Serviço","Serviço","4.7.1.0.20.","AGETOP",81846,"CAIXA DE GORDURA E INSPEÇÃO EM PVC/ABS 19 LITROS COM TAMPA E PORTA TAMPA E CESTO DE LIMPEZA REMOVÍVEL","un    ",1,null,null,null,""]
["S",3,"S",0,4,7,1,0,0,0,0,"F","Serviço","Serviço","4.7.1.0.21.","SINAPI",94495,"REGISTRO DE GAVETA BRUTO, LATÃO, ROSCÁVEL, 1\u0094, INSTALADO EM RESERVAÇÃO DE ÁGUA DE EDIFICAÇÃO QUE POSSUA RESERVATÓRIO DE FIBRA/FIBROCIMENTO \u0096 FORNECIMENTO E INSTALAÇÃO. AF_06/2016","UN",1,null,null,null,"Referência: AGETOP - 80903"]
["S",3,"S",0,4,7,1,0,0,0,0,"F","Serviço","Serviço","4.7.1.0.22.","SINAPI",89987,"REGISTRO DE GAVETA BRUTO, LATÃO, ROSCÁVEL, 3/4\", COM ACABAMENTO E CANOPLA CROMADOS. FORNECIDO E INSTALADO EM RAMAL DE ÁGUA. AF_12/2014","UN",1,null,null,null,"Referência: AGETOP - 80926"]
["S",3,"S",0,4,7,1,0,0,0,0,"F","Serviço","Serviço","4.7.1.0.23.","SINAPI",89985,"REGISTRO DE PRESSÃO BRUTO, LATÃO, ROSCÁVEL, 3/4\", COM ACABAMENTO E CANOPLA CROMADOS. FORNECIDO E INSTALADO EM RAMAL DE ÁGUA. AF_12/2014","UN",4,null,null,null,"Referência: AGETOP - 80926"]
["S",3,"S",0,4,7,1,0,0,0,0,"F","Serviço","Serviço","4.7.1.0.24.","SINAPI",89356,"TUBO, PVC, SOLDÁVEL, DN 25MM, INSTALADO EM RAMAL OU SUB-RAMAL DE ÁGUA - FORNECIMENTO E INSTALAÇÃO. AF_12/2014","M",25,null,null,null,"Referência: AGETOP - 81003"]
["S",3,"S",0,4,7,1,0,0,0,0,"F","Serviço","Serviço","4.7.1.0.25.","SINAPI",89357,"TUBO, PVC, SOLDÁVEL, DN 32MM, INSTALADO EM RAMAL OU SUB-RAMAL DE ÁGUA - FORNECIMENTO E INSTALAÇÃO. AF_12/2014","M",19,null,null,null,"Referência: AGETOP - 81004"]
["S",3,"S",0,4,7,1,0,0,0,0,"F","Serviço","Serviço","4.7.1.0.26.","SINAPI",94708,"ADAPTADOR COM FLANGES LIVRES, PVC, SOLDÁVEL, DN  25 MM X 3/4 , INSTALADO EM RESERVAÇÃO DE ÁGUA DE EDIFICAÇÃO QUE POSSUA RESERVATÓRIO DE FIBRA/FIBROCIMENTO   FORNECIMENTO E INSTALAÇÃO. AF_06/2016","UN",14,null,null,null,"Referência: AGETOP - 81041"]
["S",3,"S",0,4,7,1,0,0,0,0,"F","Serviço","Serviço","4.7.1.0.27.","SINAPI",94709,"ADAPTADOR COM FLANGES LIVRES, PVC, SOLDÁVEL, DN 32 MM X 1 , INSTALADO EM RESERVAÇÃO DE ÁGUA DE EDIFICAÇÃO QUE POSSUA RESERVATÓRIO DE FIBRA/FIBROCIMENTO   FORNECIMENTO E INSTALAÇÃO. AF_06/2016","UN",2,null,null,null,"Referência: AGETOP - 81042"]
["S",3,"S",0,4,7,1,0,0,0,0,"F","Serviço","Serviço","4.7.1.0.28.","AGETOP",81162,"BUCHA DE REDUCAO SOLD.CURTA 32 X 25 MM","Un    ",2,null,null,null,""]
["S",3,"S",0,4,7,1,0,0,0,0,"F","Serviço","Serviço","4.7.1.0.29.","SINAPI",89866,"JOELHO 90 GRAUS, PVC, SOLDÁVEL, DN 25MM, INSTALADO EM DRENO DE AR-CONDICIONADO - FORNECIMENTO E INSTALAÇÃO. AF_12/2014","UN",6,null,null,null,""]
["S",3,"S",0,4,7,1,0,0,0,0,"F","Serviço","Serviço","4.7.1.0.30.","SINAPI",94672,"JOELHO 90 GRAUS COM BUCHA DE LATÃO, PVC, SOLDÁVEL, DN  25 MM, X 3/4\u0094 INSTALADO EM RESERVAÇÃO DE ÁGUA DE EDIFICAÇÃO QUE POSSUA RESERVATÓRIO DE FIBRA/FIBROCIMENTO   FORNECIMENTO E INSTALAÇÃO. AF_06/2016","UN",6,null,null,null,""]
["S",3,"S",0,4,7,1,0,0,0,0,"F","Serviço","Serviço","4.7.1.0.31.","AGETOP",81402,"TE 90 GRAUS SOLDAVEL DIAMETRO 25 mm","Un    ",2,null,null,null,""]
["S",3,"S",0,4,7,1,0,0,0,0,"F","Serviço","Serviço","4.7.1.0.32.","SINAPI",94691,"TÊ DE REDUÇÃO, PVC, SOLDÁVEL, DN 32 MM X  25 MM, INSTALADO EM RESERVAÇÃO DE ÁGUA DE EDIFICAÇÃO QUE POSSUA RESERVATÓRIO DE FIBRA/FIBROCIMENTO   FORNECIMENTO E INSTALAÇÃO. AF_06/2016","UN",1,null,null,null,"Referência: AGETOP - 81421"]
["S",3,"S",0,4,7,1,0,0,0,0,"F","Serviço","Serviço","4.7.1.0.33.","AGETOP",81602,"BUCHA DE REDUCAO LONGA DIAM. 50 X 40 MM","Un    ",5,null,null,null,""]
["S",3,"S",0,4,7,1,0,0,0,0,"F","Serviço","Serviço","4.7.1.0.34.","AGETOP",81663,"CORPO CX. SIFONADA DIAM. 150 X 150 X 50","Un    ",2,null,null,null,""]
["S",3,"S",0,4,7,1,0,0,0,0,"F","Serviço","Serviço","4.7.1.0.35.","AGETOP",81771,"GRELHA QUADRADA BRANCA DIAM. 150 MM","Un    ",2,null,null,null,""]
["S",3,"S",0,4,7,1,0,0,0,0,"F","Serviço","Serviço","4.7.1.0.36.","AGETOP",81885,"TERMINAL DE VENTILACAO DIAMETRO 50 MM","Un    ",1,null,null,null,""]
["S",3,"S",0,4,7,1,0,0,0,0,"F","Serviço","Serviço","4.7.1.0.37.","AGETOP",81831,"CAIXA DE INSPEÇÃO - ALVENARIA DE 1/2 VEZ COM REVESTIMENTO INTERNO EM REBOCO PAULISTA A-14 (COM ADIÇÃO DE IMPERMEABILIZANTE)","m2    ",3,null,null,null,""]
["S",3,"S",0,4,7,1,0,0,0,0,"F","Serviço","Serviço","4.7.1.0.38.","SINAPI",89802,"JOELHO 45 GRAUS, PVC, SERIE NORMAL, ESGOTO PREDIAL, DN 50 MM, JUNTA ELÁSTICA, FORNECIDO E INSTALADO EM PRUMADA DE ESGOTO SANITÁRIO OU VENTILAÇÃO. AF_12/2014","UN",7,null,null,null,""]
["S",3,"S",0,4,7,1,0,0,0,0,"F","Serviço","Serviço","4.7.1.0.39.","SINAPI",89732,"JOELHO 45 GRAUS, PVC, SERIE NORMAL, ESGOTO PREDIAL, DN 50 MM, JUNTA ELÁSTICA, FORNECIDO E INSTALADO EM RAMAL DE DESCARGA OU RAMAL DE ESGOTO SANITÁRIO. AF_12/2014","UN",7,null,null,null,""]
["S",3,"S",0,4,7,1,0,0,0,0,"F","Serviço","Serviço","4.7.1.0.40.","SINAPI",89724,"JOELHO 90 GRAUS, PVC, SERIE NORMAL, ESGOTO PREDIAL, DN 40 MM, JUNTA SOLDÁVEL, FORNECIDO E INSTALADO EM RAMAL DE DESCARGA OU RAMAL DE ESGOTO SANITÁRIO. AF_12/2014","UN",12,null,null,null,""]
["S",3,"S",0,4,7,1,0,0,0,0,"F","Serviço","Serviço","4.7.1.0.41.","SINAPI",89801,"JOELHO 90 GRAUS, PVC, SERIE NORMAL, ESGOTO PREDIAL, DN 50 MM, JUNTA ELÁSTICA, FORNECIDO E INSTALADO EM PRUMADA DE ESGOTO SANITÁRIO OU VENTILAÇÃO. AF_12/2014","UN",2,null,null,null,""]
["S",3,"S",0,4,7,1,0,0,0,0,"F","Serviço","Serviço","4.7.1.0.42.","AGETOP",81973,"JUNCAO SIMPLES DIAM. 100 X 50 MM","Un    ",1,null,null,null,""]
["S",3,"S",0,4,7,1,0,0,0,0,"F","Serviço","Serviço","4.7.1.0.43.","SINAPI",89834,"JUNÇÃO SIMPLES, PVC, SERIE NORMAL, ESGOTO PREDIAL, DN 100 X 100 MM, JUNTA ELÁSTICA, FORNECIDO E INSTALADO EM PRUMADA DE ESGOTO SANITÁRIO OU VENTILAÇÃO. AF_12/2014","UN",1,null,null,null,"Referência: AGETOP - 81975"]
["S",3,"S",0,4,7,1,0,0,0,0,"F","Serviço","Serviço","4.7.1.0.44.","AGETOP",81981,"JUNÇÃO DUPLA DIAMETRO 75 MM","Un    ",1,null,null,null,""]
["S",3,"S",0,4,7,1,0,0,0,0,"F","Serviço","Serviço","4.7.1.0.45.","SINAPI",89813,"LUVA SIMPLES, PVC, SERIE NORMAL, ESGOTO PREDIAL, DN 50 MM, JUNTA ELÁSTICA, FORNECIDO E INSTALADO EM PRUMADA DE ESGOTO SANITÁRIO OU VENTILAÇÃO. AF_12/2014","UN",8,null,null,null,""]
["S",3,"S",0,4,7,1,0,0,0,0,"F","Serviço","Serviço","4.7.1.0.46.","SINAPI",89821,"LUVA SIMPLES, PVC, SERIE NORMAL, ESGOTO PREDIAL, DN 100 MM, JUNTA ELÁSTICA, FORNECIDO E INSTALADO EM PRUMADA DE ESGOTO SANITÁRIO OU VENTILAÇÃO. AF_12/2014","UN",2,null,null,null,"Referência: AGETOP - 82004"]
["S",3,"S",0,4,7,1,0,0,0,0,"F","Serviço","Serviço","4.7.1.0.47.","AGETOP",82051,"PORTA GRELHA QUADRADA BRANCO DIAM. 150 MM","Un    ",2,null,null,null,""]
["S",3,"S",0,4,7,1,0,0,0,0,"F","Serviço","Serviço","4.7.1.0.48.","AGETOP",82103,"REDUCAO EXCENTRICA 100 X 50 MM","Un    ",1,null,null,null,""]
["S",3,"S",0,4,7,1,0,0,0,0,"F","Serviço","Serviço","4.7.1.0.49.","AGETOP",82233,"TE SANITARIO DIAMETRO 100 X 50 MM","Un    ",1,null,null,null,""]
[{"$f":"CHOOSE(1+LOG(1+2*(ORÇAMENTO.Nivel=\"Nível 1\")+4*(ORÇAMENTO.Nivel=\"Nível 2\")+8*(ORÇAMENTO.Nivel=\"Nível 3\")+16*(ORÇAMENTO.Nivel=\"Nível 4\")+32*(ORÇAMENTO.Nivel=\"Serviço\"),2),0,1,2,3,4,\"S\")","v":"S"},3,"S",0,4,7,1,0,{"$f":"IF(AND($C335<=4,$C335<>0),0,IF(AND($C335=\"S\",$W335>0),OFFSET(I335,-1,0)+1,OFFSET(I335,-1,0)))","v":0},0,0,"F","Serviço","Serviço","4.7.1.0.50.","SINAPI",89711,"TUBO PVC, SERIE NORMAL, ESGOTO PREDIAL, DN 40 MM, FORNECIDO E INSTALADO EM RAMAL DE DESCARGA OU RAMAL DE ESGOTO SANITÁRIO. AF_12/2014","M",14,null,null,null,"Referência: AGETOP - 82301"]
["S",3,"S",0,4,7,1,0,0,0,0,"F","Serviço","Serviço","4.7.1.0.51.","SINAPI",89798,"TUBO PVC, SERIE NORMAL, ESGOTO PREDIAL, DN 50 MM, FORNECIDO E INSTALADO EM PRUMADA DE ESGOTO SANITÁRIO OU VENTILAÇÃO. AF_12/2014","M",26,null,null,null,""]
["S",3,"S",0,4,7,1,0,0,0,0,"F","Serviço","Serviço","4.7.1.0.52.","SINAPI",89800,"TUBO PVC, SERIE NORMAL, ESGOTO PREDIAL, DN 100 MM, FORNECIDO E INSTALADO EM PRUMADA DE ESGOTO SANITÁRIO OU VENTILAÇÃO. AF_12/2014","M",35,null,null,null,""]
["S",3,"S",0,{"$f":"IF($C338=1,OFFSET(E338,-1,0)+1,OFFSET(E338,-1,0))","v":4},{"$f":"IF($C338=1,0,IF($C338=2,OFFSET(F338,-1,0)+1,OFFSET(F338,-1,0)))","v":7},{"$f":"IF(AND($C338<=2,$C338<>0),0,IF($C338=3,OFFSET(G338,-1,0)+1,OFFSET(G338,-1,0)))","v":1},{"$f":"IF(AND($C338<=3,$C338<>0),0,IF($C338=4,OFFSET(H338,-1,0)+1,OFFSET(H338,-1,0)))","v":0},0,0,0,"F","Serviço","Serviço","4.7.1.0.53.","AGETOP",82374,"TUBO FERRO GALVANIZADO DIAM.3/4\"","m     ",10,null,null,null,""]
["S",3,"S",0,4,7,1,0,0,{"$f":"IF(OR($C339=\"S\",$C339=0),0,MATCH(0,OFFSET($D339,1,$C339,ROW($C$575)-ROW($C339)),0))","v":0},{"$f":"IF(OR($C339=\"S\",$C339=0),0,MATCH(OFFSET($D339,0,$C339)+1,OFFSET($D339,1,$C339,ROW($C$575)-ROW($C339)),0))","v":0},"F","Serviço","Serviço","4.7.1.0.54.","AGETOP",85003,"EXTINTOR PO QUIMICO SECO (6 KG) - CAPACIDADE EXTINTORA 20 BC","Un    ",1,null,null,null,""]
["S",3,"S",0,4,7,1,0,0,0,0,"F","Serviço","Serviço","4.7.1.0.55.","SINAPI",95470,"VASO SANITARIO SIFONADO CONVENCIONAL COM LOUÇA BRANCA, INCLUSO CONJUNTO DE LIGAÇÃO PARA BACIA SANITÁRIA AJUSTÁVEL - FORNECIMENTO E INSTALAÇÃO. AF_10/2016","UN",1,null,null,null,""]
[2,2,2,26,4,8,0,0,0,75,26,"F","Nível 2","Nível 2","4.8.",null,null,"INSTALAÇÕES ESPECIAIS","-",null,null,null,null,""]
["S",2,"S",0,4,8,0,0,0,0,0,"F","Serviço","Serviço","4.8.0.0.1.","AGETOP",91007,"CENTRAL DE GÁS PADRÃO AGETOP SEM INSTALAÇÕES (1+1 CILINDRO 45 KG)","Un    ",1,null,null,null,""]
["S",2,"S",0,4,8,0,0,0,0,0,"F","Serviço","Serviço","4.8.0.0.2.","AGETOP",91023,"UNIÃO S/BRONZE PRETA 3/4\" NPT 300 LBS","Un    ",3,null,null,null,""]
["S",2,"S",0,4,8,0,0,0,0,0,"F","Serviço","Serviço","4.8.0.0.3.","COMPOSIÇÃO","COMP 382_SEE","TE DE REDUCAO DE FERRO GALVANIZADO, COM ROSCA BSP, DE 3/4\" X 1/2\"","UN ",1,null,null,null,""]
["S",2,"S",0,4,8,0,0,0,0,0,"F","Serviço","Serviço","4.8.0.0.4.","COMPOSIÇÃO","COMP 383_SEE","BUCHA DE REDUCAO DE FERRO GALVANIZADO, COM ROSCA BSP, DE 1/2\" X 1/4\"","UN ",3,null,null,null,""]
["S",2,"S",0,4,8,0,0,0,0,0,"F","Serviço","Serviço","4.8.0.0.5.","AGETOP",91021,"LUVA GALVANIZADO DE REDUÇÃO 3/4\" X 1/2\" (GÁS)","Un    ",2,null,null,null,""]
["S",2,"S",0,4,8,0,0,0,0,0,"F","Serviço","Serviço","4.8.0.0.6.","SINAPI",92692,"NIPLE, EM FERRO GALVANIZADO, CONEXÃO ROSQUEADA, DN 15 (1/2\"), INSTALADO EM RAMAIS E SUB-RAMAIS DE GÁS - FORNECIMENTO E INSTALAÇÃO. AF_12/2015","UN",6,null,null,null,""]
["S",2,"S",0,4,8,0,0,0,0,0,"F","Serviço","Serviço","4.8.0.0.7.","AGETOP",91031,"NIPLE DUPLO 300 PSI 3/4\"","Un    ",6,null,null,null,""]
["S",2,"S",0,4,8,0,0,0,0,0,"F","Serviço","Serviço","4.8.0.0.8.","COMPOSIÇÃO","COMP 212_SEE","NIPLE DE REDUÇÃO 1/2\" X 1/4\" BSP","UN ",4,null,null,null,""]
["S",2,"S",0,4,8,0,0,0,0,0,"F","Serviço","Serviço","4.8.0.0.9.","COMPOSIÇÃO","COMP 213_SEE","NIPLE DE REDUÇÃO 3/4\" X 1/2\" BSP","UN ",4,null,null,null,""]
["S",2,"S",0,4,8,0,0,0,0,0,"F","Serviço","Serviço","4.8.0.0.10.","SINAPI",92688,"TUBO DE AÇO GALVANIZADO COM COSTURA, CLASSE MÉDIA, CONEXÃO ROSQUEADA, DN 20 (3/4\"), INSTALADO EM RAMAIS E SUB-RAMAIS DE GÁS - FORNECIMENTO E INSTALAÇÃO. AF_12/2015","M",18,null,null,null,""]
["S",2,"S",0,4,8,0,0,0,0,0,"F","Serviço","Serviço","4.8.0.0.11.","SINAPI",92701,"JOELHO 90 GRAUS, EM FERRO GALVANIZADO, CONEXÃO ROSQUEADA, DN 20 (3/4\"), INSTALADO EM RAMAIS E SUB-RAMAIS DE GÁS - FORNECIMENTO E INSTALAÇÃO. AF_12/2015","UN",6,null,null,null,""]
["S",2,"S",0,4,8,0,0,0,0,0,"F","Serviço","Serviço","4.8.0.0.12.","COMPOSIÇÃO","COMP 237_SEE","FITA ANTICORROSIVA","M",12,null,null,null,""]
["S",2,"S",0,4,8,0,0,0,0,0,"F","Serviço","Serviço","4.8.0.0.13.","AGETOP",91025,"VÁLVULA ESFERICA LATÃO 3/4\"","Un    ",3,null,null,null,""]
["S",2,"S",0,4,8,0,0,0,0,0,"F","Serviço","Serviço","4.8.0.0.14.","COMPOSIÇÃO","COMP 542_SEE","VÁLVULA UGV 3/4\" (S) LATÃO","UN ",1,null,null,null,""]
["S",2,"S",0,4,8,0,0,0,0,0,"F","Serviço","Serviço","4.8.0.0.15.","COMPOSIÇÃO","COMP 543_SEE","VÁLVULA UGV 1/2\" (S) LATÃO","UN ",1,null,null,null,""]
["S",2,"S",0,4,8,0,0,0,0,0,"F","Serviço","Serviço","4.8.0.0.16.","AGETOP",91029,"VALVULA DE RETENÇÃO LATÃO 1/2\" X 7/16\" NPT","Un    ",1,null,null,null,""]
["S",2,"S",0,4,8,0,0,0,0,0,"F","Serviço","Serviço","4.8.0.0.17.","COMPOSIÇÃO","COMP 211_SEE","REGULADOR DE 2º ESTÁGIO 5KG/H","UN ",1,null,null,null,""]
["S",2,"S",0,4,8,0,0,0,0,0,"F","Serviço","Serviço","4.8.0.0.18.","COMPOSIÇÃO","COMP 210_SEE","REGULADOR DE 1º ESTÁGIO 60KG/H MODELO AP-40  COM MANÔMETRO","UN ",1,null,null,null,""]
["S",2,"S",0,4,8,0,0,0,0,0,"F","Serviço","Serviço","4.8.0.0.19.","AGETOP",85003,"EXTINTOR PO QUIMICO SECO (6 KG) - CAPACIDADE EXTINTORA 20 BC","Un    ",1,null,null,null,""]
["S",{"$f":"IF(OR(C361=\"s\",C361=0),OFFSET(B361,-1,0),C361)","v":2},{"$f":"IF(OFFSET(C361,-1,0)=\"L\",1,IF(OFFSET(C361,-1,0)=1,2,IF(OR(A361=\"s\",A361=0),\"S\",IF(AND(OFFSET(C361,-1,0)=2,A361=4),3,IF(AND(OR(OFFSET(C361,-1,0)=\"s\",OFFSET(C361,-1,0)=0),A361<>\"s\",A361>OFFSET(B361,-1,0)),OFFSET(B361,-1,0),A361)))))","v":"S"},{"$f":"IF(OR(C361=\"S\",C361=0),0,IF(ISERROR(K361),J361,SMALL(J361:K361,1)))","v":0},4,8,0,0,0,0,0,"F","Serviço","Serviço","4.8.0.0.20.","COMPOSIÇÃO","COMP 235_SEE","PLACA DE SINALIZAÇÃO EM PVC COD 01 - (300X300) PROIBIDO FUMAR","UN ",2,null,null,null,""]
["S",2,"S",0,4,8,0,0,0,0,0,"F","Serviço","Serviço","4.8.0.0.21.","COMPOSIÇÃO","COMP 236_SEE","PLACA DE SINALIZAÇÃO EM PVC COD 06 - (300X300) PERIGO INFLAMÁVEL","UN ",2,null,null,null,""]
["S",2,"S",0,4,8,0,0,0,0,0,"F","Serviço","Serviço","4.8.0.0.22.","AGETOP",91043,"BRAÇADEIRA METALICA TIPO \"D\" DIAM. 3/4\"","Un    ",5,null,null,null,""]
["S",2,"S",0,4,8,0,0,0,0,0,"F","Serviço","Serviço","4.8.0.0.23.","AGETOP",71863,"PARAFUSO P/BUCHA S-10","Un    ",10,null,null,null,""]
["S",2,"S",0,4,8,0,0,0,0,0,"F","Serviço","Serviço","4.8.0.0.24.","AGETOP",70393,"BUCHA DE NYLON S-10","Un    ",10,null,null,null,""]
["S",2,"S",0,4,8,0,0,0,0,0,"F","Serviço","Serviço","4.8.0.0.25.","AGETOP",91045,"SUPORTE PARA COLETOR","Un    ",2,null,null,null,""]
[2,2,2,3,4,9,0,0,0,49,3,"F","Nível 2","Nível 2","4.9.",null,null,"ALVENARIAS E DIVISÓRIAS","-",null,null,null,null,""]
["S",2,"S",0,4,9,0,0,0,0,0,"F","Serviço","Serviço","4.9.0.0.1.","SINAPI","73937/1","COBOGO DE CONCRETO (ELEMENTO VAZADO), 7X50X50CM, ASSENTADO COM ARGAMASSA TRACO 1:4 (CIMENTO E AREIA)","M2",19,null,null,null,"Referência: AGETOP - 100501"]
["S",2,"S",0,4,9,0,0,0,0,0,"F","Serviço","Serviço","4.9.0.0.2.","SINAPI",87520,"ALVENARIA DE VEDAÇÃO DE BLOCOS CERÂMICOS FURADOS NA HORIZONTAL DE 9X19X19CM (ESPESSURA 9CM) DE PAREDES COM ÁREA LÍQUIDA MAIOR OU IGUAL A 6M² COM VÃOS E ARGAMASSA DE ASSENTAMENTO COM PREPARO MANUAL. AF_06/2014","M2",160.80000000000001,null,null,null,"Referência: AGETOP - 100201"]
[2,2,2,2,4,10,0,0,0,46,2,"F","Nível 2","Nível 2","4.10.",null,null,"IMPERMEABILIZAÇÃO","-",null,null,null,null,""]
["S",2,"S",0,4,10,0,0,0,0,0,"F","Serviço","Serviço","4.10.0.0.1.","SINAPI",98562,"IMPERMEABILIZAÇÃO DE FLOREIRA OU VIGA BALDRAME COM ARGAMASSA DE CIMENTO E AREIA, COM ADITIVO IMPERMEABILIZANTE, E = 2 CM. AF_06/2018","M2",51.56,null,null,null,"Referência: AGETOP - 120902"]
[2,2,2,2,4,11,0,0,0,44,2,"F","Nível 2","Nível 2","4.11.",null,null,"ESTRUTURAS METÁLICAS","-",null,null,null,null,""]
["S",2,"S",0,4,11,0,0,0,0,0,"F","Serviço","Serviço","4.11.0.0.1.","AGETOP",150103,"ESTRUTURA METÁLICA CONVENCIONAL EM AÇO DO TIPO USI SAC-300 COM FUNDO ANTICORROSIVO","Kg    ",1253.57,null,null,null,""]
[2,2,2,6,4,12,0,0,0,42,6,"F","Nível 2","Nível 2","4.12.",null,null,"COBERTURAS","-",null,null,null,null,""]
[3,3,3,5,4,12,1,0,0,5,29,"F","Nível 3","Nível 3","4.12.1.",null,null,"CERÂMICA","-",null,null,null,null,""]
["S",3,"S",0,4,12,1,0,0,0,0,"F","Serviço","Serviço","4.12.1.0.1.","SINAPI",94445,"TELHAMENTO COM TELHA CERÂMICA CAPA-CANAL, TIPO PLAN, COM ATÉ 2 ÁGUAS, INCLUSO TRANSPORTE VERTICAL. AF_06/2016","M2",71.37,null,null,null,"Referência: AGETOP - 160401"]
["S",3,"S",0,4,12,1,0,0,0,0,"F","Serviço","Serviço","4.12.1.0.2.","SINAPI",94221,"CUMEEIRA PARA TELHA CERÂMICA EMBOÇADA COM ARGAMASSA TRAÇO 1:2:9 (CIMENTO, CAL E AREIA) PARA TELHADOS COM ATÉ 2 ÁGUAS, INCLUSO TRANSPORTE VERTICAL. AF_06/2016","M",7.2,null,null,null,""]
["S",3,"S",0,4,12,1,0,0,0,0,"F","Serviço","Serviço","4.12.1.0.3.","SINAPI",94224,"EMBOÇAMENTO COM ARGAMASSA TRAÇO 1:2:9 (CIMENTO, CAL E AREIA). AF_06/2016","M",20.399999999999999,null,null,null,"Referência: AGETOP - 160403"]
["S",3,"S",0,4,12,1,0,0,0,0,"F","Serviço","Serviço","4.12.1.0.4.","SINAPI",94224,"EMBOÇAMENTO COM ARGAMASSA TRAÇO 1:2:9 (CIMENTO, CAL E AREIA). AF_06/2016","M",14.4,null,null,null,"Referência: AGETOP - 160403"]
[2,2,2,5,4,13,0,0,0,36,5,"F","Nível 2","Nível 2","4.13.",null,null,"ESQUADRIAS METÁLICAS","-",null,null,null,null,""]
["S",2,"S",0,4,13,0,0,0,0,0,"F","Serviço","Serviço","4.13.0.0.1.","SINAPI","74136/3","PORTA DE ACO CHAPA 24, DE ENROLAR, RAIADA, LARGA COM ACABAMENTO GALVANIZADO NATURAL","M2",5.76,null,null,null,"Referência: AGETOP - 180303"]
["S",2,"S",0,4,13,0,0,0,0,0,"F","Serviço","Serviço","4.13.0.0.2.","AGETOP",180307,"PORTAO /CHAPA TRAPEZ / TUBO DE ACO PT-5 C/FERRAGEM","m2    ",4,null,null,null,""]
["S",2,"S",0,4,13,0,0,0,0,0,"F","Serviço","Serviço","4.13.0.0.3.","AGETOP",180381,"ESQ. MAXIMO AR CHAPA/VIDRO J3/J5/J6/J8 C/FERRAGENS","m2    ",5.52,null,null,null,""]
["S",2,"S",0,4,13,0,0,0,0,0,"F","Serviço","Serviço","4.13.0.0.4.","SINAPI","73933/4","PORTA DE FERRO DE ABRIR TIPO BARRA CHATA, COM REQUADRO E GUARNICAO COMPLETA","M2",9.24,null,null,null,"Referência: AGETOP - 180501"]
[2,2,2,2,4,14,0,0,0,31,2,"F","Nível 2","Nível 2","4.14.",null,null,"VIDROS","-",null,null,null,null,""]
["S",2,"S",0,4,14,0,0,0,0,0,"F","Serviço","Serviço","4.14.0.0.1.","SINAPI",72117,"VIDRO LISO COMUM TRANSPARENTE, ESPESSURA 4MM","M2",5.52,null,null,null,"Referência: AGETOP - 190102"]
[2,2,2,4,4,15,0,0,0,29,4,"F","Nível 2","Nível 2","4.15.",null,null,"REVESTIMENTO DE PAREDE","-",null,null,null,null,""]
["S",2,"S",0,4,15,0,0,0,0,0,"F","Serviço","Serviço","4.15.0.0.1.","SINAPI",87553,"EMBOÇO, PARA RECEBIMENTO DE CERÂMICA, EM ARGAMASSA TRAÇO 1:2:8, PREPARO MECÂNICO COM BETONEIRA 400L, APLICADO MANUALMENTE EM FACES INTERNAS DE PAREDES, PARA AMBIENTE COM ÁREA MAIOR QUE 10M2, ESPESSURA DE 10MM, COM EXECUÇÃO DE TALISCAS. AF_06/2014","M2",128.43,null,null,null,""]
["S",2,"S",0,4,15,0,0,0,0,0,"F","Serviço","Serviço","4.15.0.0.2.","SINAPI",87904,"CHAPISCO APLICADO EM ALVENARIA (COM PRESENÇA DE VÃOS) E ESTRUTURAS DE CONCRETO DE FACHADA, COM COLHER DE PEDREIRO.  ARGAMASSA TRAÇO 1:3 COM PREPARO MANUAL. AF_06/2014","M2",309.60000000000002,null,null,null,"Referência: AGETOP - 200101"]
["S",2,"S",0,4,15,0,0,0,0,0,"F","Serviço","Serviço","4.15.0.0.3.","SINAPI",87273,"REVESTIMENTO CERÂMICO PARA PAREDES INTERNAS COM PLACAS TIPO ESMALTADA EXTRA DE DIMENSÕES 33X45 CM APLICADAS EM AMBIENTES DE ÁREA MAIOR QUE 5 M² NA ALTURA INTEIRA DAS PAREDES. AF_06/2014","M2",128.43,null,null,null,""]
[2,2,2,3,4,16,0,0,0,25,3,"F","Nível 2","Nível 2","4.16.",null,null,"FORROS","-",null,null,null,null,""]
["S",2,"S",0,4,16,0,0,0,0,0,"F","Serviço","Serviço","4.16.0.0.1.","SINAPI",87884,"CHAPISCO APLICADO NO TETO, COM ROLO PARA TEXTURA ACRÍLICA. ARGAMASSA INDUSTRIALIZADA COM PREPARO MANUAL. AF_06/2014","M2",40.75,null,null,null,"Referência: AGETOP - 210102"]
["S",2,"S",0,4,16,0,0,0,0,0,"F","Serviço","Serviço","4.16.0.0.2.","SINAPI",90408,"MASSA ÚNICA, PARA RECEBIMENTO DE PINTURA, EM ARGAMASSA TRAÇO 1:2:8, PREPARO MECÂNICO COM BETONEIRA 400L, APLICADA MANUALMENTE EM TETO, ESPESSURA DE 10MM, COM EXECUÇÃO DE TALISCAS. AF_03/2015","M2",40.75,null,null,null,"Referência: AGETOP - 210401"]
[2,2,2,5,4,17,0,0,0,22,5,"F","Nível 2","Nível 2","4.17.",null,null,"REVESTIMENTO DE PISO","-",null,null,null,null,""]
["S",2,"S",0,4,17,0,0,0,0,0,"F","Serviço","Serviço","4.17.0.0.1.","SINAPI",95241,"LASTRO DE CONCRETO MAGRO, APLICADO EM PISOS OU RADIERS, ESPESSURA DE 5 CM. AF_07/2016","M2",56.76,null,null,null,""]
["S",2,"S",0,4,17,0,0,0,0,0,"F","Serviço","Serviço","4.17.0.0.2.","AGETOP",221104,"RASPAGEM E APLICAÇÃO RESINA ACRÍLICA DUAS DEMÃOS","m2    ",68.900000000000006,null,null,null,""]
["S",2,"S",0,4,17,0,0,0,0,0,"F","Serviço","Serviço","4.17.0.0.3.","AGETOP",221106,"GRANITINA 8MM FUNDIDA COM CONTRAPISO (1CI:3ARML) E=2CM E JUNTA PLASTICA 27MM (COM ÓXIDO DE FERRO)","m2    ",68.900000000000006,null,null,null,""]
["S",2,"S",0,4,17,0,0,0,0,0,"F","Serviço","Serviço","4.17.0.0.4.","AGETOP",220100,"PASSEIO PROTECAO EM CONC.DESEMPEN.5 CM 1:2,5:3,5 ( INCLUSO ESPELHO DE 60CM/ESCAVAÇÃO/REATERRO/APILOAMENTO/ATERRO INTERNO)","m2    ",30.21,null,null,null,""]
[2,2,2,2,4,18,0,0,0,17,2,"F","Nível 2","Nível 2","4.18.","SINAPI",null,"REVESTIMENTO DE PISO","-",null,null,null,null,""]
["S",2,"S",0,4,18,0,0,0,0,0,"F","Serviço","Serviço","4.18.0.0.1.","AGETOP",240209,"PRATELEIRA EST.CAIBRO 4+1 TABUAS APARELHADAS E ENVERNIZADAS","m     ",3.2,null,null,null,""]
[2,2,2,12,4,19,0,0,0,15,12,"F","Nível 2","Nível 2","4.19.",null,null,"PINTURA","-",null,null,null,null,""]
[3,3,3,2,4,19,1,0,0,11,2,"F","Nível 3","Nível 3","4.19.1.",null,null,"ESMALTE SINTÉTICO","-",null,null,null,null,""]
["S",3,"S",0,4,19,1,0,0,{"$f":"IF(OR($C403=\"S\",$C403=0),0,MATCH(0,OFFSET($D403,1,$C403,ROW($C$575)-ROW($C403)),0))","v":0},{"$f":"IF(OR($C403=\"S\",$C403=0),0,MATCH(OFFSET($D403,0,$C403)+1,OFFSET($D403,1,$C403,ROW($C$575)-ROW($C403)),0))","v":0},"F","Serviço","Serviço","4.19.1.0.1.","AGETOP",261550,"PINT.ESMALTE SINT.PAREDES - 2 DEM.C/SELADOR","m2    ",40,null,null,null,""]
[3,3,3,3,4,19,2,0,0,9,3,"F","Nível 3","Nível 3","4.19.2.","AGETOP",null,"LÁTEX ACRÍLICA","-",null,null,null,null,""]
["S",3,"S",0,4,19,2,0,0,0,0,"F","Serviço","Serviço","4.19.2.0.1.","SINAPI",88489,"APLICAÇÃO MANUAL DE PINTURA COM TINTA LÁTEX ACRÍLICA EM PAREDES, DUAS DEMÃOS. AF_06/2014","M2",190.17,null,null,null,"Referência: AGETOP - 261001"]
["S",3,"S",0,4,19,2,0,0,0,0,"F","Serviço","Serviço","4.19.2.0.2.","AGETOP",261304,"EMASSAMENTO ACRILICO 2 DEMAOS","m2    ",230.17,null,null,null,""]
[3,3,3,2,4,19,3,0,0,6,2,"F","Nível 3","Nível 3","4.19.3.","AGETOP",null,"ESQUADRIAS NOVAS","-",null,null,null,null,""]
["S",3,"S",0,4,19,3,0,0,0,0,"F","Serviço","Serviço","4.19.3.0.1.","SINAPI","74145/1","PINTURA ESMALTE FOSCO, DUAS DEMAOS, SOBRE SUPERFICIE METALICA, INCLUSO UMA DEMAO DE FUNDO ANTICORROSIVO. UTILIZACAO DE REVOLVER ( AR-COMPRIMIDO).","M2",47,null,null,null,"Referência: AGETOP - 261602"]
[3,3,3,2,4,19,4,0,0,4,2,"F","Nível 3","Nível 3","4.19.4.","AGETOP",null,"ESTRUTURA METÁLICA","-",null,null,null,null,""]
["S",3,"S",0,4,19,4,0,0,0,0,"F","Serviço","Serviço","4.19.4.0.1.","SINAPI","74145/1","PINTURA ESMALTE FOSCO, DUAS DEMAOS, SOBRE SUPERFICIE METALICA, INCLUSO UMA DEMAO DE FUNDO ANTICORROSIVO. UTILIZACAO DE REVOLVER ( AR-COMPRIMIDO).","M2",71.37,null,null,null,"Referência: AGETOP - 261602"]
[3,3,3,2,4,19,5,0,0,2,{"$error":"#N/A"},"F","Nível 3","Nível 3","4.19.5.","AGETOP",null,"OUTROS","-",null,null,null,null,""]
["S",3,"S",0,4,19,5,0,0,0,0,"F","Serviço","Serviço","4.19.5.0.1.","AGETOP",260902,"PINTURA C/VERNIZ ACRILICO-02 DEMAOS","m2    ",12,null,null,null,""]
[2,2,2,3,4,20,0,0,0,3,{"$error":"#N/A"},"F","Nível 2","Nível 2","4.20.",null,null,"DIVERSOS","-",null,null,null,null,""]
["S",2,"S",0,4,20,0,0,0,0,0,"F","Serviço","Serviço","4.20.0.0.1.","AGETOP",270501,"LIMPEZA FINAL DE OBRA - (OBRAS CIVIS)","m2    ",56.76,null,null,null,""]
["S",2,"S",0,4,20,0,0,0,0,0,"F","Serviço","Serviço","4.20.0.0.2.","AGETOP",271608,"BANCADA DE GRANITO C/ESPELHO","m2    ",6.4,null,null,null,""]
[{"$f":"CHOOSE(1+LOG(1+2*(ORÇAMENTO.Nivel=\"Nível 1\")+4*(ORÇAMENTO.Nivel=\"Nível 2\")+8*(ORÇAMENTO.Nivel=\"Nível 3\")+16*(ORÇAMENTO.Nivel=\"Nível 4\")+32*(ORÇAMENTO.Nivel=\"Serviço\"),2),0,1,2,3,4,\"S\")","v":1},1,1,125,5,0,0,0,{"$f":"IF(AND($C416<=4,$C416<>0),0,IF(AND($C416=\"S\",$W416>0),OFFSET(I416,-1,0)+1,OFFSET(I416,-1,0)))","v":0},159,125,"F","Nível 1","Nível 1","5.","SINAPI",null,"BLOCO 01 SALA PADRÃO SEDUC 2017 - LAJE","-",null,null,null,null,""]
[2,2,2,2,5,1,0,0,0,124,2,"F","Nível 2","Nível 2","5.1.","SINAPI",null,"SERVIÇOS PRELIMINARES","-",null,null,null,null,""]
["S",2,"S",0,5,1,0,0,0,0,0,"F","Serviço","Serviço","5.1.0.0.1.","AGETOP",20701,"LOCAÇÃO DA OBRA, EXECUÇÃO DE GABARITO SEM REAPROVEITAMENTO, INCLUSO PINTURA (FACE INTERNA DO RIPÃO 15CM) E PIQUETE COM TESTEMUNHA","m2    ",64.260000000000005,null,null,null,""]
[2,2,2,3,{"$f":"IF($C419=1,OFFSET(E419,-1,0)+1,OFFSET(E419,-1,0))","v":5},{"$f":"IF($C419=1,0,IF($C419=2,OFFSET(F419,-1,0)+1,OFFSET(F419,-1,0)))","v":2},{"$f":"IF(AND($C419<=2,$C419<>0),0,IF($C419=3,OFFSET(G419,-1,0)+1,OFFSET(G419,-1,0)))","v":0},{"$f":"IF(AND($C419<=3,$C419<>0),0,IF($C419=4,OFFSET(H419,-1,0)+1,OFFSET(H419,-1,0)))","v":0},0,122,3,"F","Nível 2","Nível 2","5.2.","SINAPI",null,"TRANSPORTES","-",null,null,null,null,""]
["S",2,"S",0,5,2,0,0,0,0,0,"F","Serviço","Serviço","5.2.0.0.1.","SINAPI",72897,"CARGA MANUAL DE ENTULHO EM CAMINHAO BASCULANTE 6 M3","M3",6,null,null,null,""]
["S",2,"S",0,5,2,0,0,0,0,0,"F","Serviço","Serviço","5.2.0.0.2.","SINAPI",72900,"TRANSPORTE DE ENTULHO COM CAMINHAO BASCULANTE 6 M3, RODOVIA PAVIMENTADA, DMT 0,5 A 1,0 KM","M3",6,null,null,null,""]
[2,2,2,8,5,3,0,0,0,119,8,"F","Nível 2","Nível 2","5.3.","SINAPI",null,"SERVIÇO EM TERRA","-",null,null,null,null,""]
["S",2,"S",0,5,3,0,0,0,0,0,"F","Serviço","Serviço","5.3.0.0.1.","SINAPI",93358,"ESCAVAÇÃO MANUAL DE VALA COM PROFUNDIDADE MENOR OU IGUAL A 1,30 M. AF_03/2016","M3",3.12,null,null,null,"Referência: AGETOP - 40101"]
["S",2,"S",0,5,3,0,0,0,0,0,"F","Serviço","Serviço","5.3.0.0.2.","SINAPI",96995,"REATERRO MANUAL APILOADO COM SOQUETE. AF_10/2017","M3",1.81,null,null,null,"Referência: AGETOP - 40902"]
["S",2,"S",0,5,3,0,0,0,0,0,"F","Serviço","Serviço","5.3.0.0.3.","SINAPI",79480,"ESCAVACAO MECANICA CAMPO ABERTO EM SOLO EXCETO ROCHA ATE 2,00M PROFUNDIDADE","M3",12,null,null,null,"Referência: AGETOP - 41004"]
["S",2,"S",0,5,3,0,0,0,0,0,"F","Serviço","Serviço","5.3.0.0.4.","SINAPI",72898,"CARGA E DESCARGA MECANIZADAS DE ENTULHO EM CAMINHAO BASCULANTE 6 M3","M3",12,null,null,null,"Referência: AGETOP - 41005"]
["S",2,"S",0,5,3,0,0,0,0,0,"F","Serviço","Serviço","5.3.0.0.5.","AGETOP",41012,"INDENIZAÇÃO DE JAZIDA","m3    ",12,null,null,null,""]
["S",2,"S",0,5,3,0,0,0,0,0,"F","Serviço","Serviço","5.3.0.0.6.","AGETOP",41006,"TRANSPORTE DE MATERIAL ESCAVADO M3.KM","m3km  ",120,null,null,null,""]
["S",2,"S",0,5,3,0,0,0,0,0,"F","Serviço","Serviço","5.3.0.0.7.","SINAPI","74005/2","COMPACTACAO MECANICA C/ CONTROLE DO GC>=95% DO PN (AREAS) (C/MONIVELADORA 140 HP E ROLO COMPRESSOR VIBRATORIO 80 HP)","M3",9.6,null,null,null,"Referência: AGETOP - 41008"]
[2,2,2,20,5,4,0,0,0,111,20,"F","Nível 2","Nível 2","5.4.","SINAPI",null,"FUNDAÇÕES E SONDAGENS","-",null,null,null,null,""]
[3,3,3,10,5,4,1,0,0,19,10,"F","Nível 3","Nível 3","5.4.1.","SINAPI",null,"ESTACAS E BLOCOS","-",null,null,null,null,""]
["S",3,"S",0,5,4,1,0,0,0,0,"F","Serviço","Serviço","5.4.1.0.1.","SINAPI",98230,"ESTACA BROCA DE CONCRETO, DIÂMETRO DE 30 CM, PROFUNDIDADE DE ATÉ 3 M, ESCAVAÇÃO MANUAL COM TRADO CONCHA, NÃO ARMADA. AF_03/2018","M",41.5,null,null,null,"Referência: AGETOP - 50302"]
["S",3,"S",0,5,4,1,0,0,0,0,"F","Serviço","Serviço","5.4.1.0.2.","SINAPI",96522,"ESCAVAÇÃO MANUAL PARA BLOCO DE COROAMENTO OU SAPATA, SEM PREVISÃO DE FÔRMA. AF_06/2017","M3",3.12,null,null,null,"Referência: AGETOP - 50901"]
["S",3,"S",0,5,4,1,0,0,0,0,"F","Serviço","Serviço","5.4.1.0.3.","SINAPI",96995,"REATERRO MANUAL APILOADO COM SOQUETE. AF_10/2017","M3",1.7549999999999999,null,null,null,"Referência: AGETOP - 40902"]
["S",3,"S",0,5,4,1,0,0,0,0,"F","Serviço","Serviço","5.4.1.0.4.","SINAPI",94963,"CONCRETO FCK = 15MPA, TRAÇO 1:3,4:3,5 (CIMENTO/ AREIA MÉDIA/ BRITA 1)  - PREPARO MECÂNICO COM BETONEIRA 400 L. AF_07/2016","M3",1.3650000000000002,null,null,null,""]
["S",3,"S",0,5,4,1,0,0,0,0,"F","Serviço","Serviço","5.4.1.0.5.","SINAPI","74157/4","LANCAMENTO/APLICACAO MANUAL DE CONCRETO EM FUNDACOES","M3",1.37,null,null,null,"Referência: AGETOP - 51026"]
["S",3,"S",0,5,4,1,0,0,0,0,"F","Serviço","Serviço","5.4.1.0.6.","SINAPI",96544,"ARMAÇÃO DE BLOCO, VIGA BALDRAME OU SAPATA UTILIZANDO AÇO CA-50 DE 6,3 MM - MONTAGEM. AF_06/2017","KG",19.09090909090909,null,null,null,"Referência: AGETOP - 52003"]
["S",3,"S",0,5,4,1,0,0,0,0,"F","Serviço","Serviço","5.4.1.0.7.","SINAPI",96545,"ARMAÇÃO DE BLOCO, VIGA BALDRAME OU SAPATA UTILIZANDO AÇO CA-50 DE 8 MM - MONTAGEM. AF_06/2017","KG",62.72727272727272,null,null,null,"Referência: AGETOP - 52004"]
["S",3,"S",0,5,4,1,0,0,0,0,"F","Serviço","Serviço","5.4.1.0.8.","SINAPI",96546,"ARMAÇÃO DE BLOCO, VIGA BALDRAME OU SAPATA UTILIZANDO AÇO CA-50 DE 10 MM - MONTAGEM. AF_06/2017","KG",11.818181818181817,null,null,null,"Referência: AGETOP - 52005"]
["S",3,"S",0,5,4,1,0,0,0,0,"F","Serviço","Serviço","5.4.1.0.9.","SINAPI",96543,"ARMAÇÃO DE BLOCO, VIGA BALDRAME E SAPATA UTILIZANDO AÇO CA-60 DE 5 MM - MONTAGEM. AF_06/2017","KG",16.363636363636363,null,null,null,"Referência: AGETOP - 52014"]
[3,3,3,9,5,4,2,0,0,9,24,"F","Nível 3","Nível 3","5.4.2.","SINAPI",null,"VIGAS BALDRAMES","-",null,null,null,null,""]
["S",3,"S",0,5,4,2,0,0,0,0,"F","Serviço","Serviço","5.4.2.0.1.","SINAPI",96527,"ESCAVAÇÃO MANUAL DE VALA PARA VIGA BALDRAME, COM PREVISÃO DE FÔRMA. AF_06/2017","M3",3.9899999999999998,null,null,null,"Referência: AGETOP - 40101"]
["S",3,"S",0,5,4,2,0,0,0,0,"F","Serviço","Serviço","5.4.2.0.2.","SINAPI",96995,"REATERRO MANUAL APILOADO COM SOQUETE. AF_10/2017","M3",2.25,null,null,null,"Referência: AGETOP - 40902"]
["S",3,"S",0,5,4,2,0,0,0,0,"F","Serviço","Serviço","5.4.2.0.3.","AGETOP",60191,"FORMA DE TABUA CINTA BALDRAME U=8 VEZES","m2    ",30.65,null,null,null,""]
["S",3,"S",0,5,4,2,0,0,0,0,"F","Serviço","Serviço","5.4.2.0.4.","SINAPI",94963,"CONCRETO FCK = 15MPA, TRAÇO 1:3,4:3,5 (CIMENTO/ AREIA MÉDIA/ BRITA 1)  - PREPARO MECÂNICO COM BETONEIRA 400 L. AF_07/2016","M3",1.74,null,null,null,""]
["S",3,"S",0,5,4,2,0,0,0,0,"F","Serviço","Serviço","5.4.2.0.5.","SINAPI","74157/4","LANCAMENTO/APLICACAO MANUAL DE CONCRETO EM FUNDACOES","M3",1.74,null,null,null,"Referência: AGETOP - 51026"]
["S",3,"S",0,5,4,2,0,0,0,0,"F","Serviço","Serviço","5.4.2.0.6.","SINAPI",96545,"ARMAÇÃO DE BLOCO, VIGA BALDRAME OU SAPATA UTILIZANDO AÇO CA-50 DE 8 MM - MONTAGEM. AF_06/2017","KG",51.818181818181813,null,null,null,"Referência: AGETOP - 52004"]
["S",3,"S",0,5,4,2,0,0,0,0,"F","Serviço","Serviço","5.4.2.0.7.","SINAPI",96546,"ARMAÇÃO DE BLOCO, VIGA BALDRAME OU SAPATA UTILIZANDO AÇO CA-50 DE 10 MM - MONTAGEM. AF_06/2017","KG",24.545454545454543,null,null,null,"Referência: AGETOP - 52005"]
["S",3,"S",0,5,4,2,0,0,0,0,"F","Serviço","Serviço","5.4.2.0.8.","SINAPI",96543,"ARMAÇÃO DE BLOCO, VIGA BALDRAME E SAPATA UTILIZANDO AÇO CA-60 DE 5 MM - MONTAGEM. AF_06/2017","KG",40,null,null,null,"Referência: AGETOP - 52014"]
[2,2,2,19,5,5,0,0,0,91,19,"F","Nível 2","Nível 2","5.5.","SINAPI",null,"ESTRUTURA","-",null,null,null,null,""]
[3,3,3,6,5,5,1,0,0,18,6,"F","Nível 3","Nível 3","5.5.1.","SINAPI",null,"PILARES","-",null,null,null,null,""]
["S",3,"S",0,5,5,1,0,0,0,0,"F","Serviço","Serviço","5.5.1.0.1.","SINAPI",92426,"MONTAGEM E DESMONTAGEM DE FÔRMA DE PILARES RETANGULARES E ESTRUTURAS SIMILARES COM ÁREA MÉDIA DAS SEÇÕES MENOR OU IGUAL A 0,25 M², PÉ-DIREITO SIMPLES, EM CHAPA DE MADEIRA COMPENSADA RESINADA, 8 UTILIZAÇÕES. AF_12/2015","M2",16.37,null,null,null,""]
["S",3,"S",0,5,5,1,0,0,0,0,"F","Serviço","Serviço","5.5.1.0.2.","SINAPI",94964,"CONCRETO FCK = 20MPA, TRAÇO 1:2,7:3 (CIMENTO/ AREIA MÉDIA/ BRITA 1)  - PREPARO MECÂNICO COM BETONEIRA 400 L. AF_07/2016","M3",0.79,null,null,null,""]
["S",3,"S",0,5,5,1,0,0,0,0,"F","Serviço","Serviço","5.5.1.0.3.","SINAPI",92873,"LANÇAMENTO COM USO DE BALDES, ADENSAMENTO E ACABAMENTO DE CONCRETO EM ESTRUTURAS. AF_12/2015","M3",0.79,null,null,null,"Referência: AGETOP - 60801"]
["S",3,"S",0,5,5,1,0,0,0,0,"F","Serviço","Serviço","5.5.1.0.4.","SINAPI",92778,"ARMAÇÃO DE PILAR OU VIGA DE UMA ESTRUTURA CONVENCIONAL DE CONCRETO ARMADO EM UMA EDIFICAÇÃO TÉRREA OU SOBRADO UTILIZANDO AÇO CA-50 DE 10,0 MM - MONTAGEM. AF_12/2015","KG",70,null,null,null,"Referência: AGETOP - 60305"]
["S",3,"S",0,5,5,1,0,0,0,0,"F","Serviço","Serviço","5.5.1.0.5.","SINAPI",92775,"ARMAÇÃO DE PILAR OU VIGA DE UMA ESTRUTURA CONVENCIONAL DE CONCRETO ARMADO EM UMA EDIFICAÇÃO TÉRREA OU SOBRADO UTILIZANDO AÇO CA-60 DE 5,0 MM - MONTAGEM. AF_12/2015","KG",24.545454545454543,null,null,null,"Referência: AGETOP - 60314"]
[3,3,3,8,5,5,2,0,0,12,8,"F","Nível 3","Nível 3","5.5.2.","SINAPI",null,"VIGAS DE COBERTURA","-",null,null,null,null,""]
["S",3,"S",0,5,5,2,0,0,0,0,"F","Serviço","Serviço","5.5.2.0.1.","SINAPI",92464,"MONTAGEM E DESMONTAGEM DE FÔRMA DE VIGA, ESCORAMENTO METÁLICO, PÉ-DIREITO SIMPLES, EM CHAPA DE MADEIRA RESINADA, 8 UTILIZAÇÕES. AF_12/2015","M2",27.32,null,null,null,"Referência: AGETOP - 60209"]
["S",3,"S",0,5,5,2,0,0,0,0,"F","Serviço","Serviço","5.5.2.0.2.","SINAPI",94964,"CONCRETO FCK = 20MPA, TRAÇO 1:2,7:3 (CIMENTO/ AREIA MÉDIA/ BRITA 1)  - PREPARO MECÂNICO COM BETONEIRA 400 L. AF_07/2016","M3",1.63,null,null,null,""]
["S",3,"S",0,5,5,2,0,0,0,0,"F","Serviço","Serviço","5.5.2.0.3.","SINAPI",92873,"LANÇAMENTO COM USO DE BALDES, ADENSAMENTO E ACABAMENTO DE CONCRETO EM ESTRUTURAS. AF_12/2015","M3",1.63,null,null,null,"Referência: AGETOP - 60801"]
["S",3,"S",0,5,5,2,0,0,0,0,"F","Serviço","Serviço","5.5.2.0.4.","SINAPI",92777,"ARMAÇÃO DE PILAR OU VIGA DE UMA ESTRUTURA CONVENCIONAL DE CONCRETO ARMADO EM UMA EDIFICAÇÃO TÉRREA OU SOBRADO UTILIZANDO AÇO CA-50 DE 8,0 MM - MONTAGEM. AF_12/2015","KG",5.4545454545454541,null,null,null,"Referência: AGETOP - 60304"]
["S",3,"S",0,5,5,2,0,0,0,0,"F","Serviço","Serviço","5.5.2.0.5.","SINAPI",92778,"ARMAÇÃO DE PILAR OU VIGA DE UMA ESTRUTURA CONVENCIONAL DE CONCRETO ARMADO EM UMA EDIFICAÇÃO TÉRREA OU SOBRADO UTILIZANDO AÇO CA-50 DE 10,0 MM - MONTAGEM. AF_12/2015","KG",76.36363636363636,null,null,null,"Referência: AGETOP - 60305"]
["S",3,"S",0,5,5,2,0,0,0,0,"F","Serviço","Serviço","5.5.2.0.6.","SINAPI",92779,"ARMAÇÃO DE PILAR OU VIGA DE UMA ESTRUTURA CONVENCIONAL DE CONCRETO ARMADO EM UMA EDIFICAÇÃO TÉRREA OU SOBRADO UTILIZANDO AÇO CA-50 DE 12,5 MM - MONTAGEM. AF_12/2015","KG",19.09090909090909,null,null,null,"Referência: AGETOP - 60306"]
["S",3,"S",0,5,5,2,0,0,0,0,"F","Serviço","Serviço","5.5.2.0.7.","SINAPI",92775,"ARMAÇÃO DE PILAR OU VIGA DE UMA ESTRUTURA CONVENCIONAL DE CONCRETO ARMADO EM UMA EDIFICAÇÃO TÉRREA OU SOBRADO UTILIZANDO AÇO CA-60 DE 5,0 MM - MONTAGEM. AF_12/2015","KG",27.27272727272727,null,null,null,"Referência: AGETOP - 60314"]
[3,3,3,2,5,5,3,0,0,4,2,"F","Nível 3","Nível 3","5.5.3.","SINAPI",null,"LAJE","-",null,null,null,null,""]
["S",3,"S",0,5,5,3,0,0,0,0,"F","Serviço","Serviço","5.5.3.0.1.","SINAPI","74202/1","LAJE PRE-MOLDADA P/FORRO, SOBRECARGA 100KG/M2, VAOS ATE 3,50M/E=8CM, C/LAJOTAS E CAP.C/CONC FCK=20MPA, 3CM, INTER-EIXO 38CM, C/ESCORAMENTO (REAPR.3X) E FERRAGEM NEGATIVA","M2",52.78,null,null,null,""]
[3,3,3,2,5,5,4,0,0,{"$f":"IF(OR($C467=\"S\",$C467=0),0,MATCH(0,OFFSET($D467,1,$C467,ROW($C$575)-ROW($C467)),0))","v":2},{"$f":"IF(OR($C467=\"S\",$C467=0),0,MATCH(OFFSET($D467,0,$C467)+1,OFFSET($D467,1,$C467,ROW($C$575)-ROW($C467)),0))","v":{"$error":"#N/A"}},"F","Nível 3","Nível 3","5.5.4.","SINAPI",null,"OUTROS","-",null,null,null,null,""]
["S",3,"S",0,5,5,4,0,0,0,0,"F","Serviço","Serviço","5.5.4.0.1.","SINAPI","74022/30","ENSAIO DE RESISTENCIA A COMPRESSAO SIMPLES - CONCRETO","UN",6,null,null,null,"Referência: AGETOP - 50251"]
[2,2,2,29,5,6,0,0,0,72,29,"F","Nível 2","Nível 2","5.6.","SINAPI",null,"INSTALAÇÕES ELÉTRICAS","-",null,null,null,null,""]
["S",2,"S",0,5,6,0,0,0,0,0,"F","Serviço","Serviço","5.6.0.0.1.","AGETOP",70351,"BRACADEIRA METALICA TIPO \"U\" DIAM. 3/4\"","Un    ",15,null,null,null,""]
["S",2,"S",0,5,6,0,0,0,0,0,"F","Serviço","Serviço","5.6.0.0.2.","AGETOP",70352,"BRACADEIRA METALICA TIPO \"U\" DIAM. 1\"","Un    ",5,null,null,null,""]
["S",2,"S",0,5,6,0,0,0,0,0,"F","Serviço","Serviço","5.6.0.0.3.","AGETOP",70391,"BUCHA DE NYLON S-6","Un    ",100,null,null,null,""]
["S",2,"S",0,5,6,0,0,0,0,0,"F","Serviço","Serviço","5.6.0.0.4.","AGETOP",70421,"BUCHA E ARRUELA METALICA DIAM. 3/4\"","PR    ",15,null,null,null,""]
["S",2,"S",0,5,6,0,0,0,0,0,"F","Serviço","Serviço","5.6.0.0.5.","AGETOP",70422,"BUCHA E ARRUELA METALICA DIAM. 1\"","PR    ",5,null,null,null,""]
["S",2,"S",0,5,6,0,0,0,0,0,"F","Serviço","Serviço","5.6.0.0.6.","SINAPI",91927,"CABO DE COBRE FLEXÍVEL ISOLADO, 2,5 MM², ANTI-CHAMA 0,6/1,0 KV, PARA CIRCUITOS TERMINAIS - FORNECIMENTO E INSTALAÇÃO. AF_12/2015","M",220,null,null,null,"Referência: AGETOP - 70581"]
["S",2,"S",0,5,6,0,0,0,0,0,"F","Serviço","Serviço","5.6.0.0.7.","SINAPI",91929,"CABO DE COBRE FLEXÍVEL ISOLADO, 4 MM², ANTI-CHAMA 0,6/1,0 KV, PARA CIRCUITOS TERMINAIS - FORNECIMENTO E INSTALAÇÃO. AF_12/2015","M",152,null,null,null,"Referência: AGETOP - 70582"]
["S",2,"S",0,5,6,0,0,0,0,0,"F","Serviço","Serviço","5.6.0.0.8.","SINAPI",83446,"CAIXA DE PASSAGEM 30X30X40 COM TAMPA E DRENO BRITA","UN",1,null,null,null,""]
["S",2,"S",0,5,6,0,0,0,0,0,"F","Serviço","Serviço","5.6.0.0.9.","SINAPI",91936,"CAIXA OCTOGONAL 4\" X 4\", PVC, INSTALADA EM LAJE - FORNECIMENTO E INSTALAÇÃO. AF_12/2015","UN",6,null,null,null,""]
["S",2,"S",0,5,6,0,0,0,0,0,"F","Serviço","Serviço","5.6.0.0.10.","SINAPI",92867,"CAIXA RETANGULAR 4\" X 2\" ALTA (2,00 M DO PISO), METÁLICA, INSTALADA EM PAREDE - FORNECIMENTO E INSTALAÇÃO. AF_12/2015","UN",2,null,null,null,""]
["S",2,"S",0,5,6,0,0,0,0,0,"F","Serviço","Serviço","5.6.0.0.11.","SINAPI",92867,"CAIXA RETANGULAR 4\" X 2\" ALTA (2,00 M DO PISO), METÁLICA, INSTALADA EM PAREDE - FORNECIMENTO E INSTALAÇÃO. AF_12/2015","UN",2,null,null,null,""]
["S",2,"S",0,5,6,0,0,0,0,0,"F","Serviço","Serviço","5.6.0.0.12.","SINAPI",92869,"CAIXA RETANGULAR 4\" X 2\" BAIXA (0,30 M DO PISO), METÁLICA, INSTALADA EM PAREDE - FORNECIMENTO E INSTALAÇÃO. AF_12/2015","UN",3,null,null,null,""]
["S",2,"S",0,5,6,0,0,0,0,0,"F","Serviço","Serviço","5.6.0.0.13.","SINAPI",91914,"CURVA 90 GRAUS PARA ELETRODUTO, PVC, ROSCÁVEL, DN 25 MM (3/4\"), PARA CIRCUITOS TERMINAIS, INSTALADA EM PAREDE - FORNECIMENTO E INSTALAÇÃO. AF_12/2015","UN",3,null,null,null,""]
["S",2,"S",0,{"$f":"IF($C483=1,OFFSET(E483,-1,0)+1,OFFSET(E483,-1,0))","v":5},{"$f":"IF($C483=1,0,IF($C483=2,OFFSET(F483,-1,0)+1,OFFSET(F483,-1,0)))","v":6},{"$f":"IF(AND($C483<=2,$C483<>0),0,IF($C483=3,OFFSET(G483,-1,0)+1,OFFSET(G483,-1,0)))","v":0},{"$f":"IF(AND($C483<=3,$C483<>0),0,IF($C483=4,OFFSET(H483,-1,0)+1,OFFSET(H483,-1,0)))","v":0},0,0,0,"F","Serviço","Serviço","5.6.0.0.14.","SINAPI",93654,"DISJUNTOR MONOPOLAR TIPO DIN, CORRENTE NOMINAL DE 16A - FORNECIMENTO E INSTALAÇÃO. AF_04/2016","UN",2,null,null,null,""]
["S",2,"S",0,5,6,0,0,0,0,0,"F","Serviço","Serviço","5.6.0.0.15.","SINAPI",93656,"DISJUNTOR MONOPOLAR TIPO DIN, CORRENTE NOMINAL DE 25A - FORNECIMENTO E INSTALAÇÃO. AF_04/2016","UN",2,null,null,null,""]
["S",2,"S",0,5,6,0,0,0,0,0,"F","Serviço","Serviço","5.6.0.0.16.","SINAPI",93671,"DISJUNTOR TRIPOLAR TIPO DIN, CORRENTE NOMINAL DE 32A - FORNECIMENTO E INSTALAÇÃO. AF_04/2016","UN",1,null,null,null,"Referência: AGETOP - 71173"]
["S",2,"S",0,5,6,0,0,0,0,0,"F","Serviço","Serviço","5.6.0.0.17.","SINAPI",91871,"ELETRODUTO RÍGIDO ROSCÁVEL, PVC, DN 25 MM (3/4\"), PARA CIRCUITOS TERMINAIS, INSTALADO EM PAREDE - FORNECIMENTO E INSTALAÇÃO. AF_12/2015","M",45,null,null,null,"Referência: AGETOP - 71201"]
["S",2,"S",0,5,6,0,0,0,0,0,"F","Serviço","Serviço","5.6.0.0.18.","SINAPI",91872,"ELETRODUTO RÍGIDO ROSCÁVEL, PVC, DN 32 MM (1\"), PARA CIRCUITOS TERMINAIS, INSTALADO EM PAREDE - FORNECIMENTO E INSTALAÇÃO. AF_12/2015","M",15,null,null,null,"Referência: AGETOP - 71202"]
["S",2,"S",0,5,6,0,0,0,0,0,"F","Serviço","Serviço","5.6.0.0.19.","SINAPI",91953,"INTERRUPTOR SIMPLES (1 MÓDULO), 10A/250V, INCLUINDO SUPORTE E PLACA - FORNECIMENTO E INSTALAÇÃO. AF_12/2015","UN",2,null,null,null,"Referência: AGETOP - 71440"]
["S",2,"S",0,5,6,0,0,0,0,0,"F","Serviço","Serviço","5.6.0.0.20.","SINAPI",97610,"LÂMPADA COMPACTA DE LED 10 W, BASE E27 - FORNECIMENTO E INSTALAÇÃO. AF_11/2017","UN",15,null,null,null,""]
["S",2,"S",0,5,6,0,0,0,0,0,"F","Serviço","Serviço","5.6.0.0.21.","SINAPI",97591,"LUMINÁRIA TIPO PLAFON REDONDO COM VIDRO FOSCO, DE SOBREPOR, COM 2 LÂMPADAS DE 15 W - FORNECIMENTO E INSTALAÇÃO. AF_11/2017","UN",6,null,null,null,""]
["S",2,"S",0,5,6,0,0,0,0,0,"F","Serviço","Serviço","5.6.0.0.22.","SINAPI",97593,"LUMINÁRIA TIPO SPOT, DE SOBREPOR, COM 1 LÂMPADA DE 15 W - FORNECIMENTO E INSTALAÇÃO. AF_11/2017","UN",3,null,null,null,"Referência: AGETOP - 71688"]
["S",2,"S",0,5,6,0,0,0,0,0,"F","Serviço","Serviço","5.6.0.0.23.","SINAPI",91884,"LUVA PARA ELETRODUTO, PVC, ROSCÁVEL, DN 25 MM (3/4\"), PARA CIRCUITOS TERMINAIS, INSTALADA EM PAREDE - FORNECIMENTO E INSTALAÇÃO. AF_12/2015","UN",15,null,null,null,"Referência: AGETOP - 71741"]
["S",2,"S",0,5,6,0,0,0,0,0,"F","Serviço","Serviço","5.6.0.0.24.","SINAPI",91885,"LUVA PARA ELETRODUTO, PVC, ROSCÁVEL, DN 32 MM (1\"), PARA CIRCUITOS TERMINAIS, INSTALADA EM PAREDE - FORNECIMENTO E INSTALAÇÃO. AF_12/2015","UN",5,null,null,null,"Referência: AGETOP - 71742"]
["S",2,"S",0,5,6,0,0,0,0,0,"F","Serviço","Serviço","5.6.0.0.25.","AGETOP",71861,"PARAFUSO P/BUCHA S-6","Un    ",100,null,null,null,""]
["S",2,"S",0,5,6,0,0,0,0,0,"F","Serviço","Serviço","5.6.0.0.26.","SINAPI",83463,"QUADRO DE DISTRIBUICAO DE ENERGIA EM CHAPA DE ACO GALVANIZADO, PARA 12 DISJUNTORES TERMOMAGNETICOS MONOPOLARES, COM BARRAMENTO TRIFASICO E NEUTRO - FORNECIMENTO E INSTALACAO","UN",1,null,null,null,""]
["S",2,"S",0,5,6,0,0,0,0,0,"F","Serviço","Serviço","5.6.0.0.27.","SINAPI",91996,"TOMADA MÉDIA DE EMBUTIR (1 MÓDULO), 2P+T 10 A, INCLUINDO SUPORTE E PLACA - FORNECIMENTO E INSTALAÇÃO. AF_12/2015","UN",3,null,null,null,"Referência: AGETOP - 72578"]
["S",2,"S",0,5,6,0,0,0,0,0,"F","Serviço","Serviço","5.6.0.0.28.","SINAPI",91993,"TOMADA ALTA DE EMBUTIR (1 MÓDULO), 2P+T 20 A, INCLUINDO SUPORTE E PLACA - FORNECIMENTO E INSTALAÇÃO. AF_12/2015","UN",2,null,null,null,"Referência: AGETOP - 72585"]
[2,2,2,3,5,7,0,0,0,43,3,"F","Nível 2","Nível 2","5.7.","AGETOP",null,"ALVENARIAS E DIVISÓRIAS","-",null,null,null,null,""]
["S",2,"S",0,5,7,0,0,0,0,0,"F","Serviço","Serviço","5.7.0.0.1.","SINAPI",87503,"ALVENARIA DE VEDAÇÃO DE BLOCOS CERÂMICOS FURADOS NA HORIZONTAL DE 9X19X19CM (ESPESSURA 9CM) DE PAREDES COM ÁREA LÍQUIDA MAIOR OU IGUAL A 6M² SEM VÃOS E ARGAMASSA DE ASSENTAMENTO COM PREPARO EM BETONEIRA. AF_06/2014","M2",82.064999999999984,null,null,null,"Referência: AGETOP - 100201"]
["S",2,"S",0,5,7,0,0,0,0,0,"F","Serviço","Serviço","5.7.0.0.2.","SINAPI",93201,"FIXAÇÃO (ENCUNHAMENTO) DE ALVENARIA DE VEDAÇÃO COM ARGAMASSA APLICADA COM COLHER. AF_03/2016","M",27.9,null,null,null,""]
[2,2,2,2,5,8,0,0,0,40,2,"F","Nível 2","Nível 2","5.8.",null,null,"IMPERMEABILIZAÇÃO","-",null,null,null,null,""]
["S",2,"S",0,5,8,0,0,0,0,0,"F","Serviço","Serviço","5.8.0.0.1.","SINAPI","74106/1","IMPERMEABILIZACAO DE ESTRUTURAS ENTERRADAS, COM TINTA ASFALTICA, DUAS DEMAOS.","M2",22.8,null,null,null,""]
[2,2,2,2,5,9,0,0,0,38,2,"F","Nível 2","Nível 2","5.9.",null,null,"ESTRUTURAS METÁLICAS","-",null,null,null,null,""]
["S",2,"S",0,5,9,0,0,0,0,0,"F","Serviço","Serviço","5.9.0.0.1.","AGETOP",150103,"ESTRUTURA METÁLICA CONVENCIONAL EM AÇO DO TIPO USI SAC-300 COM FUNDO ANTICORROSIVO","Kg    ",1291.08,null,null,null,""]
[2,2,2,4,5,10,0,0,0,36,4,"F","Nível 2","Nível 2","5.10.",null,null,"COBERTURAS","-",null,null,null,null,""]
["S",2,"S",0,5,10,0,0,0,0,0,"F","Serviço","Serviço","5.10.0.0.1.","SINAPI",94445,"TELHAMENTO COM TELHA CERÂMICA CAPA-CANAL, TIPO PLAN, COM ATÉ 2 ÁGUAS, INCLUSO TRANSPORTE VERTICAL. AF_06/2016","M2",88.69,null,null,null,"Referência: AGETOP - 160401"]
["S",2,"S",0,5,10,0,0,0,0,0,"F","Serviço","Serviço","5.10.0.0.2.","SINAPI",94221,"CUMEEIRA PARA TELHA CERÂMICA EMBOÇADA COM ARGAMASSA TRAÇO 1:2:9 (CIMENTO, CAL E AREIA) PARA TELHADOS COM ATÉ 2 ÁGUAS, INCLUSO TRANSPORTE VERTICAL. AF_06/2016","M",9.0500000000000007,null,null,null,""]
["S",2,"S",0,5,10,0,0,0,0,0,"F","Serviço","Serviço","5.10.0.0.3.","SINAPI",94224,"EMBOÇAMENTO COM ARGAMASSA TRAÇO 1:2:9 (CIMENTO, CAL E AREIA). AF_06/2016","M",37.700000000000003,null,null,null,"Referência: AGETOP - 160403"]
[2,2,2,4,5,11,0,0,0,32,4,"F","Nível 2","Nível 2","5.11.",null,null,"ESQUADRIAS METÁLICAS","-",null,null,null,null,""]
["S",2,"S",0,5,11,0,0,0,0,0,"F","Serviço","Serviço","5.11.0.0.1.","SINAPI",94562,"JANELA DE AÇO DE CORRER, 4 FOLHAS, FIXAÇÃO COM ARGAMASSA, SEM VIDROS, PADRONIZADA. AF_07/2016","M2",4.8,null,null,null,"Referência: AGETOP - 180401"]
["S",2,"S",0,5,11,0,0,0,0,0,"F","Serviço","Serviço","5.11.0.0.2.","SINAPI",94559,"JANELA DE AÇO BASCULANTE, FIXAÇÃO COM ARGAMASSA, SEM VIDROS, PADRONIZADA. AF_07/2016","M2",2.4,null,null,null,"Referência: AGETOP - 180404"]
["S",2,"S",0,5,11,0,0,0,0,0,"F","Serviço","Serviço","5.11.0.0.3.","SINAPI","73933/4","PORTA DE FERRO DE ABRIR TIPO BARRA CHATA, COM REQUADRO E GUARNICAO COMPLETA","M2",1.6800000000000002,null,null,null,"Referência: AGETOP - 180501"]
[2,2,2,2,5,12,0,0,0,28,2,"F","Nível 2","Nível 2","5.12.",null,null,"VIDROS","-",null,null,null,null,""]
["S",2,"S",0,5,12,0,0,0,0,0,"F","Serviço","Serviço","5.12.0.0.1.","SINAPI",72117,"VIDRO LISO COMUM TRANSPARENTE, ESPESSURA 4MM","M2",7.1999999999999993,null,null,null,"Referência: AGETOP - 190102"]
[2,2,2,4,5,13,0,0,0,26,4,"F","Nível 2","Nível 2","5.13.",null,null,"REVESTIMENTO DE PAREDE","-",null,null,null,null,""]
["S",2,"S",0,5,13,0,0,0,0,0,"F","Serviço","Serviço","5.13.0.0.1.","SINAPI",87879,"CHAPISCO APLICADO EM ALVENARIAS E ESTRUTURAS DE CONCRETO INTERNAS, COM COLHER DE PEDREIRO.  ARGAMASSA TRAÇO 1:3 COM PREPARO EM BETONEIRA 400L. AF_06/2014","M2",164.14,null,null,null,""]
["S",2,"S",0,5,13,0,0,0,0,0,"F","Serviço","Serviço","5.13.0.0.2.","SINAPI",87548,"MASSA ÚNICA, PARA RECEBIMENTO DE PINTURA, EM ARGAMASSA TRAÇO 1:2:8, PREPARO MANUAL, APLICADA MANUALMENTE EM FACES INTERNAS DE PAREDES, ESPESSURA DE 10MM, COM EXECUÇÃO DE TALISCAS. AF_06/2014","M2",164.14,null,null,null,"Referência: AGETOP - 200500"]
["S",2,"S",0,5,13,0,0,0,0,0,"F","Serviço","Serviço","5.13.0.0.3.","SINAPI",84088,"PEITORIL EM MARMORE BRANCO, LARGURA DE 15CM, ASSENTADO COM ARGAMASSA TRACO 1:4 (CIMENTO E AREIA MEDIA), PREPARO MANUAL DA ARGAMASSA","M",8,null,null,null,""]
[2,2,2,2,{"$f":"IF($C519=1,OFFSET(E519,-1,0)+1,OFFSET(E519,-1,0))","v":5},{"$f":"IF($C519=1,0,IF($C519=2,OFFSET(F519,-1,0)+1,OFFSET(F519,-1,0)))","v":14},{"$f":"IF(AND($C519<=2,$C519<>0),0,IF($C519=3,OFFSET(G519,-1,0)+1,OFFSET(G519,-1,0)))","v":0},{"$f":"IF(AND($C519<=3,$C519<>0),0,IF($C519=4,OFFSET(H519,-1,0)+1,OFFSET(H519,-1,0)))","v":0},0,22,2,"F","Nível 2","Nível 2","5.14.",null,null,"FORROS","-",null,null,null,null,""]
["S",2,"S",0,5,14,0,0,0,0,0,"F","Serviço","Serviço","5.14.0.0.1.","SINAPI",87414,"APLICAÇÃO MANUAL DE GESSO DESEMPENADO (SEM TALISCAS) EM TETO DE AMBIENTES DE ÁREA MAIOR QUE 10M², ESPESSURA DE 1,0CM. AF_06/2014","M2",48.51,null,null,null,"Referência: AGETOP - 210515"]
[2,2,2,5,5,15,0,0,0,20,5,"F","Nível 2","Nível 2","5.15.","SINAPI",null,"REVESTIMENTO DE PISO","-",null,null,null,null,""]
["S",2,"S",0,5,15,0,0,0,0,0,"F","Serviço","Serviço","5.15.0.0.1.","SINAPI",95240,"LASTRO DE CONCRETO MAGRO, APLICADO EM PISOS OU RADIERS, ESPESSURA DE 3 CM. AF_07/2016","M2",84.96,null,null,null,""]
["S",2,"S",0,5,15,0,0,0,0,0,"F","Serviço","Serviço","5.15.0.0.2.","SINAPI",94992,"EXECUÇÃO DE PASSEIO (CALÇADA) OU PISO DE CONCRETO COM CONCRETO MOLDADO IN LOCO, FEITO EM OBRA, ACABAMENTO CONVENCIONAL, ESPESSURA 6 CM, ARMADO. AF_07/2016","M2",20.699999999999989,null,null,null,""]
["S",2,"S",0,5,15,0,0,0,0,0,"F","Serviço","Serviço","5.15.0.0.3.","SINAPI",84191,"PISO EM GRANILITE, MARMORITE OU GRANITINA ESPESSURA 8 MM, INCLUSO JUNTAS DE DILATACAO PLASTICAS","M2",59.98,null,null,null,"Referência: AGETOP - 221101"]
["S",2,"S",0,5,15,0,0,0,0,0,"F","Serviço","Serviço","5.15.0.0.4.","AGETOP",221104,"RASPAGEM E APLICAÇÃO RESINA ACRÍLICA DUAS DEMÃOS","m2    ",62.333399999999997,null,null,null,""]
[2,2,2,2,5,16,0,0,0,15,2,"F","Nível 2","Nível 2","5.16.","SINAPI",null,"MARCENARIA","-",null,null,null,null,""]
["S",2,"S",0,5,16,0,0,0,0,0,"F","Serviço","Serviço","5.16.0.0.1.","AGETOP",240106,"BATE CARTEIRA ENVERNIZADO E ASSENT. 2,5 X 12 CM","M     ",20.32,null,null,null,""]
[2,2,2,10,5,17,0,0,0,13,10,"F","Nível 2","Nível 2","5.17.","SINAPI",null,"PINTURA","-",null,null,null,null,""]
["S",2,"S",0,5,17,0,0,0,0,0,"F","Serviço","Serviço","5.17.0.0.1.","SINAPI","74145/1","PINTURA ESMALTE FOSCO, DUAS DEMAOS, SOBRE SUPERFICIE METALICA, INCLUSO UMA DEMAO DE FUNDO ANTICORROSIVO. UTILIZACAO DE REVOLVER ( AR-COMPRIMIDO).","M2",177.38,null,null,null,"Referência: AGETOP - 261602"]
["S",2,"S",0,5,17,0,0,0,0,0,"F","Serviço","Serviço","5.17.0.0.2.","SINAPI",88423,"APLICAÇÃO MANUAL DE PINTURA COM TINTA TEXTURIZADA ACRÍLICA EM PAREDES EXTERNAS DE CASAS, UMA COR. AF_06/2014","M2",71.594999999999999,null,null,null,"Referência: AGETOP - 260601"]
["S",2,"S",0,5,17,0,0,0,{"$f":"IF(OR($C531=\"S\",$C531=0),0,MATCH(0,OFFSET($D531,1,$C531,ROW($C$575)-ROW($C531)),0))","v":0},{"$f":"IF(OR($C531=\"S\",$C531=0),0,MATCH(OFFSET($D531,0,$C531)+1,OFFSET($D531,1,$C531,ROW($C$575)-ROW($C531)),0))","v":0},"F","Serviço","Serviço","5.17.0.0.3.","SINAPI",88489,"APLICAÇÃO MANUAL DE PINTURA COM TINTA LÁTEX ACRÍLICA EM PAREDES, DUAS DEMÃOS. AF_06/2014","M2",50.555000000000007,null,null,null,"Referência: AGETOP - 261001"]
["S",2,"S",0,5,17,0,0,0,0,0,"F","Serviço","Serviço","5.17.0.0.4.","SINAPI",88497,"APLICAÇÃO E LIXAMENTO DE MASSA LÁTEX EM PAREDES, DUAS DEMÃOS. AF_06/2014","M2",97.860000000000014,null,null,null,"Referência: AGETOP - 261300"]
["S",2,"S",0,5,17,0,0,0,0,0,"F","Serviço","Serviço","5.17.0.0.5.","AGETOP",261550,"PINT.ESMALTE SINT.PAREDES - 2 DEM.C/SELADOR","m2    ",47.305,null,null,null,""]
["S",2,"S",0,5,17,0,0,0,0,0,"F","Serviço","Serviço","5.17.0.0.6.","SINAPI",88496,"APLICAÇÃO E LIXAMENTO DE MASSA LÁTEX EM TETO, DUAS DEMÃOS. AF_06/2014","M2",48.51,null,null,null,"Referência: AGETOP - 261300"]
["S",2,"S",0,5,17,0,0,0,0,0,"F","Serviço","Serviço","5.17.0.0.7.","SINAPI",88486,"APLICAÇÃO MANUAL DE PINTURA COM TINTA LÁTEX PVA EM TETO, DUAS DEMÃOS. AF_06/2014","M2",48.51,null,null,null,"Referência: AGETOP - 261307"]
["S",2,"S",0,5,17,0,0,0,0,0,"F","Serviço","Serviço","5.17.0.0.8.","SINAPI","74145/1","PINTURA ESMALTE FOSCO, DUAS DEMAOS, SOBRE SUPERFICIE METALICA, INCLUSO UMA DEMAO DE FUNDO ANTICORROSIVO. UTILIZACAO DE REVOLVER ( AR-COMPRIMIDO).","M2",17.759999999999998,null,null,null,"Referência: AGETOP - 261602"]
["S",2,"S",0,5,17,0,0,0,0,0,"F","Serviço","Serviço","5.17.0.0.9.","AGETOP",261623,"LETREIRO PEQ.PORTE A PINCEL EM PAREDE E PORTAS","m2    ",0.31666666666666665,null,null,null,""]
[2,2,2,3,5,18,0,0,0,3,{"$error":"#N/A"},"F","Nível 2","Nível 2","5.18.","SINAPI",null,"DIVERSOS","-",null,null,null,null,""]
["S",2,"S",0,5,18,0,0,0,0,0,"F","Serviço","Serviço","5.18.0.0.1.","AGETOP",271210,"QUADRO DE GIZ EMBOÇO/PINTURA COMPLETO","m2    ",5.04,null,null,null,""]
["S",2,"S",0,5,18,0,0,0,0,0,"F","Serviço","Serviço","5.18.0.0.2.","AGETOP",270501,"LIMPEZA FINAL DE OBRA - (OBRAS CIVIS)","m2    ",64.260000000000005,null,null,null,""]
[1,1,1,34,6,0,0,0,0,34,{"$error":"#N/A"},"F","Nível 1","Nível 1","6.","SINAPI",null,"PASSARELA MODELO 02 - PADRÃO SÉC. XXI 2015","-",null,null,null,null,""]
[2,2,2,2,6,1,0,0,0,33,2,"F","Nível 2","Nível 2","6.1.","SINAPI",null,"SERVIÇOS PRELIMINARES","-",null,null,null,null,""]
["S",2,"S",0,6,1,0,0,0,0,0,"F","Serviço","Serviço","6.1.0.0.1.","AGETOP",20701,"LOCAÇÃO DA OBRA, EXECUÇÃO DE GABARITO SEM REAPROVEITAMENTO, INCLUSO PINTURA (FACE INTERNA DO RIPÃO 15CM) E PIQUETE COM TESTEMUNHA","m2    ",20.16,null,null,null,""]
[2,2,2,3,6,2,0,0,0,31,3,"F","Nível 2","Nível 2","6.2.","AGETOP",null,"TRANSPORTES","-",null,null,null,null,""]
["S",2,"S",0,6,2,0,0,0,0,0,"F","Serviço","Serviço","6.2.0.0.1.","SINAPI",72900,"TRANSPORTE DE ENTULHO COM CAMINHAO BASCULANTE 6 M3, RODOVIA PAVIMENTADA, DMT 0,5 A 1,0 KM","M3",6,null,null,null,""]
["S",2,"S",0,6,2,0,0,0,0,0,"F","Serviço","Serviço","6.2.0.0.2.","SINAPI",72897,"CARGA MANUAL DE ENTULHO EM CAMINHAO BASCULANTE 6 M3","M3",6,null,null,null,""]
[2,2,2,9,6,3,0,0,0,28,9,"F","Nível 2","Nível 2","6.3.","AGETOP",null,"FUNDAÇÕES E SONDAGENS","-",null,null,null,null,""]
["S",2,"S",0,6,3,0,0,0,0,0,"F","Serviço","Serviço","6.3.0.0.1.","SINAPI",96534,"FABRICAÇÃO, MONTAGEM E DESMONTAGEM DE FÔRMA PARA BLOCO DE COROAMENTO, EM MADEIRA SERRADA, E=25 MM, 4 UTILIZAÇÕES. AF_06/2017","M2",5.28,null,null,null,"Referência: AGETOP - 51009"]
["S",2,"S",0,6,3,0,0,0,0,0,"F","Serviço","Serviço","6.3.0.0.2.","SINAPI",96523,"ESCAVAÇÃO MANUAL PARA BLOCO DE COROAMENTO OU SAPATA, COM PREVISÃO DE FÔRMA. AF_06/2017","M3",1.0289999999999999,null,null,null,"Referência: AGETOP - 50901"]
["S",2,"S",0,6,3,0,0,0,0,0,"F","Serviço","Serviço","6.3.0.0.3.","AGETOP",50902,"APILOAMENTO (BLOCOS/SAPATAS)","m2    ",1,null,null,null,""]
["S",2,"S",0,6,3,0,0,0,0,0,"F","Serviço","Serviço","6.3.0.0.4.","SINAPI",96995,"REATERRO MANUAL APILOADO COM SOQUETE. AF_10/2017","M3",0.44899999999999995,null,null,null,"Referência: AGETOP - 40902"]
["S",2,"S",0,6,3,0,0,0,0,0,"F","Serviço","Serviço","6.3.0.0.5.","SINAPI",94964,"CONCRETO FCK = 20MPA, TRAÇO 1:2,7:3 (CIMENTO/ AREIA MÉDIA/ BRITA 1)  - PREPARO MECÂNICO COM BETONEIRA 400 L. AF_07/2016","M3",0.57999999999999996,null,null,null,""]
["S",2,"S",0,6,3,0,0,0,0,0,"F","Serviço","Serviço","6.3.0.0.6.","SINAPI","74157/4","LANCAMENTO/APLICACAO MANUAL DE CONCRETO EM FUNDACOES","M3",0.57999999999999996,null,null,null,"Referência: AGETOP - 51026"]
["S",2,"S",0,6,3,0,0,0,0,0,"F","Serviço","Serviço","6.3.0.0.7.","SINAPI",96547,"ARMAÇÃO DE BLOCO, VIGA BALDRAME OU SAPATA UTILIZANDO AÇO CA-50 DE 12,5 MM - MONTAGEM. AF_06/2017","KG",13.18181818181818,null,null,null,"Referência: AGETOP - 52006"]
["S",2,"S",0,6,3,0,0,0,0,0,"F","Serviço","Serviço","6.3.0.0.8.","SINAPI",96543,"ARMAÇÃO DE BLOCO, VIGA BALDRAME E SAPATA UTILIZANDO AÇO CA-60 DE 5 MM - MONTAGEM. AF_06/2017","KG",8.7272727272727266,null,null,null,"Referência: AGETOP - 52014"]
[2,2,2,6,6,4,0,0,0,19,6,"F","Nível 2","Nível 2","6.4.","AGETOP",null,"ESTRUTURA","-",null,null,null,null,""]
["S",2,"S",0,6,4,0,0,0,0,0,"F","Serviço","Serviço","6.4.0.0.1.","SINAPI",92426,"MONTAGEM E DESMONTAGEM DE FÔRMA DE PILARES RETANGULARES E ESTRUTURAS SIMILARES COM ÁREA MÉDIA DAS SEÇÕES MENOR OU IGUAL A 0,25 M², PÉ-DIREITO SIMPLES, EM CHAPA DE MADEIRA COMPENSADA RESINADA, 8 UTILIZAÇÕES. AF_12/2015","M2",1.29,null,null,null,""]
["S",2,"S",0,6,4,0,0,0,0,0,"F","Serviço","Serviço","6.4.0.0.2.","SINAPI",94964,"CONCRETO FCK = 20MPA, TRAÇO 1:2,7:3 (CIMENTO/ AREIA MÉDIA/ BRITA 1)  - PREPARO MECÂNICO COM BETONEIRA 400 L. AF_07/2016","M3",0.11,null,null,null,""]
["S",2,"S",0,6,4,0,0,0,0,0,"F","Serviço","Serviço","6.4.0.0.3.","SINAPI",92873,"LANÇAMENTO COM USO DE BALDES, ADENSAMENTO E ACABAMENTO DE CONCRETO EM ESTRUTURAS. AF_12/2015","M3",0.11,null,null,null,"Referência: AGETOP - 60801"]
["S",2,"S",0,6,4,0,0,0,0,0,"F","Serviço","Serviço","6.4.0.0.4.","SINAPI",92779,"ARMAÇÃO DE PILAR OU VIGA DE UMA ESTRUTURA CONVENCIONAL DE CONCRETO ARMADO EM UMA EDIFICAÇÃO TÉRREA OU SOBRADO UTILIZANDO AÇO CA-50 DE 12,5 MM - MONTAGEM. AF_12/2015","KG",2.8181818181818179,null,null,null,"Referência: AGETOP - 60306"]
["S",2,"S",0,6,4,0,0,0,0,0,"F","Serviço","Serviço","6.4.0.0.5.","SINAPI",92775,"ARMAÇÃO DE PILAR OU VIGA DE UMA ESTRUTURA CONVENCIONAL DE CONCRETO ARMADO EM UMA EDIFICAÇÃO TÉRREA OU SOBRADO UTILIZANDO AÇO CA-60 DE 5,0 MM - MONTAGEM. AF_12/2015","KG",1.4545454545454546,null,null,null,"Referência: AGETOP - 60314"]
[2,2,2,2,6,5,0,0,0,13,2,"F","Nível 2","Nível 2","6.5.",null,null,"IMPERMEABILIZAÇÃO","-",null,null,null,null,""]
["S",2,"S",0,6,5,0,0,0,0,0,"F","Serviço","Serviço","6.5.0.0.1.","SINAPI",98562,"IMPERMEABILIZAÇÃO DE FLOREIRA OU VIGA BALDRAME COM ARGAMASSA DE CIMENTO E AREIA, COM ADITIVO IMPERMEABILIZANTE, E = 2 CM. AF_06/2018","M2",3.6,null,null,null,"Referência: AGETOP - 120902"]
[2,2,2,2,6,6,0,0,0,11,2,"F","Nível 2","Nível 2","6.6.",null,null,"ESTRUTURAS METÁLICAS","-",null,null,null,null,""]
["S",2,"S",0,6,6,0,0,0,0,0,"F","Serviço","Serviço","6.6.0.0.1.","AGETOP",150103,"ESTRUTURA METÁLICA CONVENCIONAL EM AÇO DO TIPO USI SAC-300 COM FUNDO ANTICORROSIVO","Kg    ",270.56000000000006,null,null,null,""]
[2,2,2,3,6,7,0,0,0,9,3,"F","Nível 2","Nível 2","6.7.",null,null,"COBERTURAS","-",null,null,null,null,""]
["S",2,"S",0,6,7,0,0,0,0,0,"F","Serviço","Serviço","6.7.0.0.1.","SINAPI",94213,"TELHAMENTO COM TELHA DE AÇO/ALUMÍNIO E = 0,5 MM, COM ATÉ 2 ÁGUAS, INCLUSO IÇAMENTO. AF_06/2016","M2",25.92,null,null,null,"Referência: AGETOP - 160905"]
["S",2,"S",0,6,7,0,0,0,0,0,"F","Serviço","Serviço","6.7.0.0.2.","SINAPI",94228,"CALHA EM CHAPA DE AÇO GALVANIZADO NÚMERO 24, DESENVOLVIMENTO DE 50 CM, INCLUSO TRANSPORTE VERTICAL. AF_06/2016","M",7.2,null,null,null,"Referência: AGETOP - 160601"]
[2,2,2,4,6,8,0,0,0,6,4,"F","Nível 2","Nível 2","6.8.",null,null,"PINTURA","-",null,null,null,null,""]
["S",2,"S",0,6,8,0,0,0,0,0,"F","Serviço","Serviço","6.8.0.0.1.","SINAPI",95241,"LASTRO DE CONCRETO MAGRO, APLICADO EM PISOS OU RADIERS, ESPESSURA DE 5 CM. AF_07/2016","M2",20.16,null,null,null,""]
["S",2,"S",0,6,8,0,0,0,0,0,"F","Serviço","Serviço","6.8.0.0.2.","SINAPI",84191,"PISO EM GRANILITE, MARMORITE OU GRANITINA ESPESSURA 8 MM, INCLUSO JUNTAS DE DILATACAO PLASTICAS","M2",20.16,null,null,null,"Referência: AGETOP - 221101"]
["S",2,"S",0,6,8,0,0,0,0,0,"F","Serviço","Serviço","6.8.0.0.3.","AGETOP",221104,"RASPAGEM E APLICAÇÃO RESINA ACRÍLICA DUAS DEMÃOS","m2    ",20.72,null,null,null,""]
[2,2,2,2,6,9,0,0,0,2,{"$error":"#N/A"},"F","Nível 2","Nível 2","6.9.",null,null,"DIVERSOS","-",null,null,null,null,""]
["S",2,"S",0,6,9,0,0,0,0,0,"F","Serviço","Serviço","6.9.0.0.1.","SINAPI","74145/1","PINTURA ESMALTE FOSCO, DUAS DEMAOS, SOBRE SUPERFICIE METALICA, INCLUSO UMA DEMAO DE FUNDO ANTICORROSIVO. UTILIZACAO DE REVOLVER ( AR-COMPRIMIDO).","M2",51.84,null,null,null,"Referência: AGETOP - 261602"]
[-1,null,-1,null,0,0,0,0,0,null,null,"F"]
[null,null,null,null,null,null,null,null,null,null,null,"F",null,null,null,null,null,"OBS: OS QUANTITATIVOS DE MATERIAIS  DAS INSTALAÇÕES HIDROSSANITÁRIAS, ELÉTRICAS E ESPECIAIS SÃO FORNECIDOS PELOS PROFISSIONAIS RESPONSÁVEIS PELOS RESPECTIVOS PROJETOS.",null,null,"VALOR TOTAL"]
[null,null,null,null,null,null,null,null,null,null,null,"F",null,null,null,null,null,null,null,null,"VALOR BDI (25,39%)"]
[null,null,null,null,null,null,null,null,null,null,null,"F",null,null,null,null,null,null,null,null,"TOTAL ORÇAMENTO"]
[null,null,null,null,null,null,null,null,null,null,null,"F"]
[null,null,null,null,null,null,null,null,null,null,null,"F",null,null,null,null,null,null,null,null,"CUSTO POR M2 ³"]
[null,null,null,null,null,null,null,null,null,null,null,"F",null,null,null,null,null,null,null,null,"MATERIAL S/ BDI"]
[null,null,null,null,null,null,null,null,null,null,null,"F",null,null,null,null,null,null,null,null,"MÃO DE OBRA S/ BDI"]
[null,null,null,null,null,null,null,null,null,null,null,"F"]
[null,null,null,null,null,null,null,null,null,null,null,"F",null,null,null,null,"(1) Conforme previsto pelo DECRETO Nº 7.983, DE 8 DE ABRIL DE 2013, os preços adotados são aqueles constantes dos sistemas de referência indicados. Justifica-se o uso dos preços destas composições de custos unitários devido ao seu valor ser menor à mediana de seus correspondentes na tabela SINAPI;"]
[null,null,null,null,null,null,null,null,null,null,null,"F",null,null,null,null,"(2) Optou-se pelo uso das composições de custos da AGETOP para itens não presentes na SINAPI;"]
[null,null,null,null,null,null,null,null,null,null,null,"F",null,null,null,null,"(3) Para itens da AGETOP, os vidros não estão inclusos nas esquadrias e já foram considerados os custos de contramarco para as esquadrias de alumínio;"]
[null,null,null,null,null,null,null,null,null,null,null,"F",null,null,null,null,"(4) Nos casos em que houver execução de granitina e omissão do item AGETOP 221102, considerou-se que o quantitativo para o rodapé, de altura igual a 7cm, foi incorporado na área de piso;"]
[null,null,null,null,null,null,null,null,null,null,null,"F",null,null,null,null,"(5) O custo unitário aproximado por metro quadrado é calculado dividindo-se o valor total do orçamento pela área total de construção."]
[null,null,null,null,null,null,null,null,null,null,null,"F"]
[null,null,null,null,null,null,null,null,null,null,null,"F"]
[]
[null,null,null,null,null,null,null,null,null,null,null,null,null,null,"SOMATÓRIO DE SERVIÇOS"]
[null,null,null,null,null,null,null,null,null,null,null,null,null,null,"ITEM","DESCRIÇÃO DOS SERVIÇOS",null,null,"PREÇO SEM BDI",null,null,"PREÇO COM BDI",null,"PARTICIPAÇÃO ( % )"]
[null,null,null,null,null,null,null,null,null,null,null,null,null,null,"a.","SERVIÇOS PRELIMINARES",null,null,{"$f":"SUMIF($R$19:$R$575,$P594,$W$19:$W$575)","v":0},null,null,{"$f":"ROUND(S594*(1+BDI.Taxa),2)","v":0},null,{"$f":"IFERROR(ROUND($V594*100/$W$578,2),0)","v":0}]
[null,null,null,null,null,null,null,null,null,null,null,null,null,null,"b.","TRANSPORTES",null,null,0,null,null,0,null,{"$f":"IFERROR(ROUND($V595*100/$W$578,2),0)","v":0}]
[null,null,null,null,null,null,null,null,null,null,null,null,null,null,"c.","SERVIÇO EM TERRA",null,null,0,null,null,0,null,0]
[null,null,null,null,null,null,null,null,null,null,null,null,null,null,"d.","FUNDAÇÕES E SONDAGENS",null,null,0,null,null,0,null,0]
[null,null,null,null,null,null,null,null,null,null,null,null,null,null,"e.","ESTRUTURA",null,null,0,null,null,0,null,0]
[null,null,null,null,null,null,null,null,null,null,null,null,null,null,"f.","INSTALAÇÕES ELÉTRICAS",null,null,0,null,null,0,null,0]
[null,null,null,null,null,null,null,null,null,null,null,null,null,null,"g.","INSTALAÇÕES HIDROSSANITÁRIAS",null,null,0,null,null,0,null,0]
[null,null,null,null,null,null,null,null,null,null,null,null,null,null,"h","INSTALAÇÕES ESPECIAIS",null,null,0,null,null,0,null,0]
[null,null,null,null,null,null,null,null,null,null,null,null,null,null,"i.","ALVENARIAS E DIVISÓRIAS",null,null,0,null,null,0,null,0]
[null,null,null,null,null,null,null,null,null,null,null,null,null,null,"j.","ALVENARIA AUTO-PORTANTE",null,null,0,null,null,0,null,0]
[null,null,null,null,null,null,null,null,null,null,null,null,null,null,"k.","IMPERMEABILIZAÇÃO",null,null,0,null,null,0,null,0]
[null,null,null,null,null,null,null,null,null,null,null,null,null,null,"l.","ISOLAMENTO TÉRMICO E ACÚSTICO",null,null,0,null,null,0,null,0]
[null,null,null,null,null,null,null,null,null,null,null,null,null,null,"m.","ESTRUTURA DE MADEIRA",null,null,0,null,null,0,null,0]
[null,null,null,null,null,null,null,null,null,null,null,null,null,null,"n.","ESTRUTURAS METÁLICAS",null,null,0,null,null,0,null,0]
[null,null,null,null,null,null,null,null,null,null,null,null,null,null,"o.","COBERTURAS",null,null,0,null,null,0,null,0]
[null,null,null,null,null,null,null,null,null,null,null,null,null,null,"p.","ESQUADRIAS DE MADEIRA",null,null,0,null,null,0,null,0]
[null,null,null,null,null,null,null,null,null,null,null,null,null,null,"q.","ESQUADRIAS METÁLICAS",null,null,0,null,null,{"$f":"ROUND(S610*(1+BDI.Taxa),2)","v":0},null,0]
[null,null,null,null,null,null,null,null,null,null,null,null,null,null,"r.","VIDROS",null,null,0,null,null,0,null,0]
[null,null,null,null,null,null,null,null,null,null,null,null,null,null,"s.","REVESTIMENTO DE PAREDE",null,null,0,null,null,0,null,0]
[null,null,null,null,null,null,null,null,null,null,null,null,null,null,"t.","FORROS",null,null,0,null,null,0,null,0]
[null,null,null,null,null,null,null,null,null,null,null,null,null,null,"u.","REVESTIMENTO DE PISO",null,null,0,null,null,0,null,0]
[null,null,null,null,null,null,null,null,null,null,null,null,null,null,"v.","FERRAGENS",null,null,0,null,null,0,null,0]
[null,null,null,null,null,null,null,null,null,null,null,null,null,null,"w.","MARCENARIA",null,null,0,null,null,0,null,0]
[null,null,null,null,null,null,null,null,null,null,null,null,null,null,"x.","ADMINISTRAÇÃO",null,null,0,null,null,0,null,0]
[null,null,null,null,null,null,null,null,null,null,null,null,null,null,"y.","PINTURA",null,null,0,null,null,{"$f":"ROUND(S618*(1+BDI.Taxa),2)","v":0},null,0]
[null,null,null,null,null,null,null,null,null,null,null,null,null,null,"z.","DIVERSOS",null,null,0,null,null,{"$f":"IF(S619>0,IF((SUM(V594:W618)+ROUND(S619*(1+BDI.Taxa),2))<>V621,V621-SUM(V594:W618),ROUND(S619*(1+BDI.Taxa),2)),0)","v":0},null,{"$f":"IF(S619>0,IF((SUM(X594:X618)+IFERROR(ROUND($V619*100/$W$578,2),0))<>X621,X621-SUM(X594:X618),IFERROR(ROUND($V619*100/$W$578,2),0)),0)","v":0}]
[null,null,null,null,null,null,null,null,null,null,null,null,null,null,"TOTAL GERAL DO ORÇAMENTO (R$)",null,null,null,{"$f":"SUM(S594:U619)","v":0},null,null,{"$f":"SUM(V594:W619)","v":0},null,{"$f":"SUM(X594:X619)","v":0}]
[null,null,null,null,null,null,null,null,null,null,null,null,null,null,null,null,null,null,{"$f":"$W$576","v":0},null,null,{"$f":"$W$578","v":0},null,100]
[null,null,null,null,null,null,null,null,null,null,null,null,null,null,null,null,null,null,"(TOTAL SEM BDI)",null,null,"(TOTAL COM BDI)",null,"(ARRED porcentagem)"]
[null,null,null,null,null,null,null,null,null,null,null,null,null,null,null,null,null,null,{"$f":"IF(AND(S620=S621,S620>0),\"OK\",\"ERRO\")","v":"ERRO"},null,null,{"$f":"IF(AND(V620=V621,V620>0),\"OK\",\"ERRO\")","v":"ERRO"},null,{"$f":"IF(X620=100,\"OK\",\"ERRO\")","v":"ERRO"}]
[]
[]
[null,null,null,null,null,null,null,null,null,null,null,null,null,null,"RESUMO GERAL DO ORÇAMENTO"]
[null,null,null,null,null,null,null,null,null,null,null,null,null,null,"ITEM","DESCRIÇÃO DOS SERVIÇOS",null,null,"PREÇO SEM BDI",null,null,"PREÇO COM BDI",null,"PARTICIPAÇÃO ( % )"]
[null,null,null,null,null,null,null,null,null,null,null,null,null,null,"1.",{"$f":"IFERROR(VLOOKUP(O628,$O$19:$W$575,4,FALSE),\"\")","v":"REFORMA"},null,null,{"$f":"IF(P629=\"\",$S$649-SUM(OFFSET($S$627:S627,0,0,COUNTA($S$627:S627),1)),SUMIF($R$19:$R$575,$P628,$W$19:$W$575))","v":0},null,null,{"$f":"IF(P629=\"\",$V$649-SUM(OFFSET($V$627:V627,0,0,COUNTA($V$627:V627),1)),ROUND(S628*(1+BDI.Taxa),2))","v":0},null,{"$f":"IF(P629=\"\",$X$649-SUM(OFFSET($X$627:X627,0,0,COUNTA($X$627:X627),1)),ROUND(V628*100/ORÇAMENTO.TotalOrçamento,2))","v":{"$error":"#DIV/0!"}}]
[null,null,null,null,null,null,null,null,null,null,null,null,null,null,"2.","ACESSIBILIDADE",null,null,{"$f":"IF(P630=\"\",$S$649-SUM(OFFSET($S$627:S628,0,0,COUNTA($S$627:S628),1)),SUMIF($R$19:$R$575,$P629,$W$19:$W$575))","v":0},null,null,{"$f":"IF(P630=\"\",$V$649-SUM(OFFSET($V$627:V628,0,0,COUNTA($V$627:V628),1)),ROUND(S629*(1+BDI.Taxa),2))","v":0},null,{"$f":"IF(P630=\"\",$X$649-SUM(OFFSET($X$627:X628,0,0,COUNTA($X$627:X628),1)),ROUND(V629*100/ORÇAMENTO.TotalOrçamento,2))","v":{"$error":"#DIV/0!"}}]
[null,null,null,null,null,null,null,null,null,null,null,null,null,null,"3.","IMPLANTAÇÃO",null,null,{"$f":"IF(P631=\"\",$S$649-SUM(OFFSET($S$627:S629,0,0,COUNTA($S$627:S629),1)),SUMIF($R$19:$R$575,$P630,$W$19:$W$575))","v":0},null,null,{"$f":"IF(P631=\"\",$V$649-SUM(OFFSET($V$627:V629,0,0,COUNTA($V$627:V629),1)),ROUND(S630*(1+BDI.Taxa),2))","v":0},null,{"$f":"IF(P631=\"\",$X$649-SUM(OFFSET($X$627:X629,0,0,COUNTA($X$627:X629),1)),ROUND(V630*100/ORÇAMENTO.TotalOrçamento,2))","v":{"$error":"#DIV/0!"}}]
[null,null,null,null,null,null,null,null,null,null,null,null,null,null,"4.","COZINHA SEDUC OPÇÃO 2",null,null,{"$f":"IF(P632=\"\",$S$649-SUM(OFFSET($S$627:S630,0,0,COUNTA($S$627:S630),1)),SUMIF($R$19:$R$575,$P631,$W$19:$W$575))","v":0},null,null,{"$f":"IF(P632=\"\",$V$649-SUM(OFFSET($V$627:V630,0,0,COUNTA($V$627:V630),1)),ROUND(S631*(1+BDI.Taxa),2))","v":0},null,{"$f":"IF(P632=\"\",$X$649-SUM(OFFSET($X$627:X630,0,0,COUNTA($X$627:X630),1)),ROUND(V631*100/ORÇAMENTO.TotalOrçamento,2))","v":{"$error":"#DIV/0!"}}]
[null,null,null,null,null,null,null,null,null,null,null,null,null,null,"5.","BLOCO 01 SALA PADRÃO SEDUC 2017 - LAJE",null,null,{"$f":"IF(P633=\"\",$S$649-SUM(OFFSET($S$627:S631,0,0,COUNTA($S$627:S631),1)),SUMIF($R$19:$R$575,$P632,$W$19:$W$575))","v":0},null,null,{"$f":"IF(P633=\"\",$V$649-SUM(OFFSET($V$627:V631,0,0,COUNTA($V$627:V631),1)),ROUND(S632*(1+BDI.Taxa),2))","v":0},null,{"$f":"IF(P633=\"\",$X$649-SUM(OFFSET($X$627:X631,0,0,COUNTA($X$627:X631),1)),ROUND(V632*100/ORÇAMENTO.TotalOrçamento,2))","v":{"$error":"#DIV/0!"}}]
[null,null,null,null,null,null,null,null,null,null,null,null,null,null,"6.","PASSARELA MODELO 02 - PADRÃO SÉC. XXI 2015",null,null,{"$f":"IF(P634=\"\",$S$649-SUM(OFFSET($S$627:S632,0,0,COUNTA($S$627:S632),1)),SUMIF($R$19:$R$575,$P633,$W$19:$W$575))","v":0},null,null,{"$f":"IF(P634=\"\",$V$649-SUM(OFFSET($V$627:V632,0,0,COUNTA($V$627:V632),1)),ROUND(S633*(1+BDI.Taxa),2))","v":0},null,{"$f":"IF(P634=\"\",$X$649-SUM(OFFSET($X$627:X632,0,0,COUNTA($X$627:X632),1)),ROUND(V633*100/ORÇAMENTO.TotalOrçamento,2))","v":{"$error":"#DIV/0!"}}]
[null,null,null,null,null,null,null,null,null,null,null,null,null,null,"7.","",null,null,{"$f":"IF(P635=\"\",$S$649-SUM(OFFSET($S$627:S633,0,0,COUNTA($S$627:S633),1)),SUMIF($R$19:$R$575,$P634,$W$19:$W$575))","v":0},null,null,{"$f":"IF(P635=\"\",$V$649-SUM(OFFSET($V$627:V633,0,0,COUNTA($V$627:V633),1)),ROUND(S634*(1+BDI.Taxa),2))","v":0},null,{"$f":"IF(P635=\"\",$X$649-SUM(OFFSET($X$627:X633,0,0,COUNTA($X$627:X633),1)),ROUND(V634*100/ORÇAMENTO.TotalOrçamento,2))","v":{"$error":"#DIV/0!"}}]
[null,null,null,null,null,null,null,null,null,null,null,null,null,null,"8.","",null,null,{"$f":"IF(P636=\"\",$S$649-SUM(OFFSET($S$627:S634,0,0,COUNTA($S$627:S634),1)),SUMIF($R$19:$R$575,$P635,$W$19:$W$575))","v":0},null,null,{"$f":"IF(P636=\"\",$V$649-SUM(OFFSET($V$627:V634,0,0,COUNTA($V$627:V634),1)),ROUND(S635*(1+BDI.Taxa),2))","v":0},null,{"$f":"IF(P636=\"\",$X$649-SUM(OFFSET($X$627:X634,0,0,COUNTA($X$627:X634),1)),ROUND(V635*100/ORÇAMENTO.TotalOrçamento,2))","v":{"$error":"#DIV/0!"}}]
[null,null,null,null,null,null,null,null,null,null,null,null,null,null,"9.","",null,null,{"$f":"IF(P637=\"\",$S$649-SUM(OFFSET($S$627:S635,0,0,COUNTA($S$627:S635),1)),SUMIF($R$19:$R$575,$P636,$W$19:$W$575))","v":0},null,null,{"$f":"IF(P637=\"\",$V$649-SUM(OFFSET($V$627:V635,0,0,COUNTA($V$627:V635),1)),ROUND(S636*(1+BDI.Taxa),2))","v":0},null,{"$f":"IF(P637=\"\",$X$649-SUM(OFFSET($X$627:X635,0,0,COUNTA($X$627:X635),1)),ROUND(V636*100/ORÇAMENTO.TotalOrçamento,2))","v":{"$error":"#DIV/0!"}}]
[null,null,null,null,null,null,null,null,null,null,null,null,null,null,"10.","",null,null,{"$f":"IF(P638=\"\",$S$649-SUM(OFFSET($S$627:S636,0,0,COUNTA($S$627:S636),1)),SUMIF($R$19:$R$575,$P637,$W$19:$W$575))","v":0},null,null,{"$f":"IF(P638=\"\",$V$649-SUM(OFFSET($V$627:V636,0,0,COUNTA($V$627:V636),1)),ROUND(S637*(1+BDI.Taxa),2))","v":0},null,{"$f":"IF(P638=\"\",$X$649-SUM(OFFSET($X$627:X636,0,0,COUNTA($X$627:X636),1)),ROUND(V637*100/ORÇAMENTO.TotalOrçamento,2))","v":{"$error":"#DIV/0!"}}]
[null,null,null,null,null,null,null,null,null,null,null,null,null,null,"11.","",null,null,{"$f":"IF(P639=\"\",$S$649-SUM(OFFSET($S$627:S637,0,0,COUNTA($S$627:S637),1)),SUMIF($R$19:$R$575,$P638,$W$19:$W$575))","v":0},null,null,{"$f":"IF(P639=\"\",$V$649-SUM(OFFSET($V$627:V637,0,0,COUNTA($V$627:V637),1)),ROUND(S638*(1+BDI.Taxa),2))","v":0},null,{"$f":"IF(P639=\"\",$X$649-SUM(OFFSET($X$627:X637,0,0,COUNTA($X$627:X637),1)),ROUND(V638*100/ORÇAMENTO.TotalOrçamento,2))","v":{"$error":"#DIV/0!"}}]
[null,null,null,null,null,null,null,null,null,null,null,null,null,null,"12.","",null,null,{"$f":"IF(P640=\"\",$S$649-SUM(OFFSET($S$627:S638,0,0,COUNTA($S$627:S638),1)),SUMIF($R$19:$R$575,$P639,$W$19:$W$575))","v":0},null,null,{"$f":"IF(P640=\"\",$V$649-SUM(OFFSET($V$627:V638,0,0,COUNTA($V$627:V638),1)),ROUND(S639*(1+BDI.Taxa),2))","v":0},null,{"$f":"IF(P640=\"\",$X$649-SUM(OFFSET($X$627:X638,0,0,COUNTA($X$627:X638),1)),ROUND(V639*100/ORÇAMENTO.TotalOrçamento,2))","v":{"$error":"#DIV/0!"}}]
[null,null,null,null,null,null,null,null,null,null,null,null,null,null,"13.","",null,null,{"$f":"IF(P641=\"\",$S$649-SUM(OFFSET($S$627:S639,0,0,COUNTA($S$627:S639),1)),SUMIF($R$19:$R$575,$P640,$W$19:$W$575))","v":0},null,null,{"$f":"IF(P641=\"\",$V$649-SUM(OFFSET($V$627:V639,0,0,COUNTA($V$627:V639),1)),ROUND(S640*(1+BDI.Taxa),2))","v":0},null,{"$f":"IF(P641=\"\",$X$649-SUM(OFFSET($X$627:X639,0,0,COUNTA($X$627:X639),1)),ROUND(V640*100/ORÇAMENTO.TotalOrçamento,2))","v":{"$error":"#DIV/0!"}}]
[null,null,null,null,null,null,null,null,null,null,null,null,null,null,"14.","",null,null,{"$f":"IF(P642=\"\",$S$649-SUM(OFFSET($S$627:S640,0,0,COUNTA($S$627:S640),1)),SUMIF($R$19:$R$575,$P641,$W$19:$W$575))","v":0},null,null,{"$f":"IF(P642=\"\",$V$649-SUM(OFFSET($V$627:V640,0,0,COUNTA($V$627:V640),1)),ROUND(S641*(1+BDI.Taxa),2))","v":0},null,{"$f":"IF(P642=\"\",$X$649-SUM(OFFSET($X$627:X640,0,0,COUNTA($X$627:X640),1)),ROUND(V641*100/ORÇAMENTO.TotalOrçamento,2))","v":{"$error":"#DIV/0!"}}]
[null,null,null,null,null,null,null,null,null,null,null,null,null,null,"15.","",null,null,{"$f":"IF(P643=\"\",$S$649-SUM(OFFSET($S$627:S641,0,0,COUNTA($S$627:S641),1)),SUMIF($R$19:$R$575,$P642,$W$19:$W$575))","v":0},null,null,{"$f":"IF(P643=\"\",$V$649-SUM(OFFSET($V$627:V641,0,0,COUNTA($V$627:V641),1)),ROUND(S642*(1+BDI.Taxa),2))","v":0},null,{"$f":"IF(P643=\"\",$X$649-SUM(OFFSET($X$627:X641,0,0,COUNTA($X$627:X641),1)),ROUND(V642*100/ORÇAMENTO.TotalOrçamento,2))","v":{"$error":"#DIV/0!"}}]
[null,null,null,null,null,null,null,null,null,null,null,null,null,null,"16.","",null,null,{"$f":"IF(P644=\"\",$S$649-SUM(OFFSET($S$627:S642,0,0,COUNTA($S$627:S642),1)),SUMIF($R$19:$R$575,$P643,$W$19:$W$575))","v":0},null,null,{"$f":"IF(P644=\"\",$V$649-SUM(OFFSET($V$627:V642,0,0,COUNTA($V$627:V642),1)),ROUND(S643*(1+BDI.Taxa),2))","v":0},null,{"$f":"IF(P644=\"\",$X$649-SUM(OFFSET($X$627:X642,0,0,COUNTA($X$627:X642),1)),ROUND(V643*100/ORÇAMENTO.TotalOrçamento,2))","v":{"$error":"#DIV/0!"}}]
[null,null,null,null,null,null,null,null,null,null,null,null,null,null,"17.","",null,null,{"$f":"IF(P645=\"\",$S$649-SUM(OFFSET($S$627:S643,0,0,COUNTA($S$627:S643),1)),SUMIF($R$19:$R$575,$P644,$W$19:$W$575))","v":0},null,null,{"$f":"IF(P645=\"\",$V$649-SUM(OFFSET($V$627:V643,0,0,COUNTA($V$627:V643),1)),ROUND(S644*(1+BDI.Taxa),2))","v":0},null,{"$f":"IF(P645=\"\",$X$649-SUM(OFFSET($X$627:X643,0,0,COUNTA($X$627:X643),1)),ROUND(V644*100/ORÇAMENTO.TotalOrçamento,2))","v":{"$error":"#DIV/0!"}}]
[null,null,null,null,null,null,null,null,null,null,null,null,null,null,"18.","",null,null,{"$f":"IF(P646=\"\",$S$649-SUM(OFFSET($S$627:S644,0,0,COUNTA($S$627:S644),1)),SUMIF($R$19:$R$575,$P645,$W$19:$W$575))","v":0},null,null,{"$f":"IF(P646=\"\",$V$649-SUM(OFFSET($V$627:V644,0,0,COUNTA($V$627:V644),1)),ROUND(S645*(1+BDI.Taxa),2))","v":0},null,{"$f":"IF(P646=\"\",$X$649-SUM(OFFSET($X$627:X644,0,0,COUNTA($X$627:X644),1)),ROUND(V645*100/ORÇAMENTO.TotalOrçamento,2))","v":{"$error":"#DIV/0!"}}]
[null,null,null,null,null,null,null,null,null,null,null,null,null,null,"19.","",null,null,{"$f":"IF(P647=\"\",$S$649-SUM(OFFSET($S$627:S645,0,0,COUNTA($S$627:S645),1)),SUMIF($R$19:$R$575,$P646,$W$19:$W$575))","v":0},null,null,{"$f":"IF(P647=\"\",$V$649-SUM(OFFSET($V$627:V645,0,0,COUNTA($V$627:V645),1)),ROUND(S646*(1+BDI.Taxa),2))","v":0},null,{"$f":"IF(P647=\"\",$X$649-SUM(OFFSET($X$627:X645,0,0,COUNTA($X$627:X645),1)),ROUND(V646*100/ORÇAMENTO.TotalOrçamento,2))","v":{"$error":"#DIV/0!"}}]
[null,null,null,null,null,null,null,null,null,null,null,null,null,null,"20.","",null,null,{"$f":"IF(P648=\"\",$S$649-SUM(OFFSET($S$627:S646,0,0,COUNTA($S$627:S646),1)),SUMIF($R$19:$R$575,$P647,$W$19:$W$575))","v":0},null,null,{"$f":"IF(P648=\"\",$V$649-SUM(OFFSET($V$627:V646,0,0,COUNTA($V$627:V646),1)),ROUND(S647*(1+BDI.Taxa),2))","v":0},null,{"$f":"IF(P648=\"\",$X$649-SUM(OFFSET($X$627:X646,0,0,COUNTA($X$627:X646),1)),ROUND(V647*100/ORÇAMENTO.TotalOrçamento,2))","v":{"$error":"#DIV/0!"}}]
[null,null,null,null,null,null,null,null,null,null,null,null,null,null,"TOTAL GERAL DO ORÇAMENTO (R$)",null,null,null,{"$f":"SUM(S628:U647)","v":0},null,null,{"$f":"SUM(V628:W647)","v":0},null,{"$f":"SUM(X628:X647)","v":{"$error":"#DIV/0!"}}]
[null,null,null,null,null,null,null,null,null,null,null,null,null,null,null,null,null,null,{"$f":"$W$576","v":0},null,null,{"$f":"$W$578","v":0},null,100]
[null,null,null,null,null,null,null,null,null,null,null,null,null,null,null,null,null,null,"(TOTAL SEM BDI)",null,null,"(TOTAL COM BDI)",null,"(ARRED porcentagem)"]
[null,null,null,null,null,null,null,null,null,null,null,null,null,null,null,null,null,null,{"$f":"IF(AND(S648=S649,S648>0),\"OK\",\"ERRO\")","v":"ERRO"},null,null,{"$f":"IF(AND(V648=V649,V648>0),\"OK\",\"ERRO\")","v":"ERRO"},null,{"$f":"IF(AND(X648=100,S628<>0),\"OK\",\"ERRO\")","v":{"$error":"#DIV/0!"}}]

{"sheet":"Resumo ","index":1,"n_rows":39,"n_cols":9,"rows_kept":39,"cut":false,"hidden":false,"merged":[[42,3,42,7],[11,1,11,2],[12,1,12,2],[15,2,15,3],[16,2,16,3],[14,1,14,8],[17,2,17,3],[23,2,23,3],[18,2,18,3],[19,2,19,3],[20,2,20,3],[41,3,41,7],[24,2,24,3],[26,2,26,3],[27,2,27,3],[38,1,38,8],[1,1,1,8],[2,6,2,8],[3,6,3,8],[4,1,4,8],[5,6,5,8],[6,6,6,8],[7,1,7,8],[8,6,8,8],[9,6,9,8],[13,1,13,8],[0,1,0,8],[36,1,36,5],[2,1,2,5],[3,1,3,5],[5,1,5,5],[6,1,6,5],[8,1,8,5],[9,1,9,5],[11,3,11,5],[12,3,12,5],[10,1,10,8],[11,6,11,8],[12,6,12,8],[25,2,25,3],[21,2,21,3],[22,2,22,3],[13,0,14,0],[34,2,34,3],[35,2,35,3],[31,2,31,3],[32,2,32,3],[33,2,33,3],[28,2,28,3],[29,2,29,3],[30,2,30,3]]}
[]
[]
[null,"UNIDADE ESCOLAR",null,null,null,null,"CÓDIGO INEP"]
[null,{"$f":"Orçamento!$O$4","v":"COLÉGIO ESTADUAL ELVIRA LEÃO BARRETO"},null,null,null,null,{"$f":"Orçamento!V4","v":52042910}]
[]
[null,"OBRA",null,null,null,null,"CIDADE"]
[null,{"$f":"Orçamento!$O$7","v":"REFORMA"},null,null,null,null,{"$f":"Orçamento!$V$7","v":"SIMOLÂNDIA"}]
[]
[null,"ENDEREÇO",null,null,null,null,"CRE"]
[null,{"$f":"Orçamento!$R$10","v":"R HUMBERTO ALENCAR CASTELO BRANCO S/N, CENTRO, CEP:73930-000"},null,null,null,null,{"$f":"Orçamento!$O$10","v":"POSSE"}]
[]
[null,"REFERÊNCIA",null,"DATA",null,null,"ÁREA TOTAL CONSTRUÍDA (M²)"]
[null,{"$f":"CONCATENATE(\"AGETOP E SINAPI - \",Orçamento!$W$10)","v":"AGETOP E SINAPI - DESONERADA"},null,{"$f":"Orçamento!$S$7","v":"2020-05-12"},null,null,{"$f":"Orçamento!$S$13","v":1267.68}]
["FILTRO"]
[null,"RESUMO GERAL DO ORÇAMENTO"]
["↓","ITEM","DESCRIÇÃO DOS SERVIÇOS",null,"UNID","QUANT","PREÇO SEM BDI","PREÇO COM BDI","PARTICIP. (%)"]
[{"$f":"IF(E17>0,\"F\",\"\")","v":"F"},"1.",{"$f":"Orçamento!$P628","v":"REFORMA"},null,"UN ",1,{"$f":"IFERROR(Orçamento!S628,\"-\")","v":0},{"$f":"IFERROR(Orçamento!V628,\"\")","v":0},{"$f":"Orçamento!X628","v":{"$error":"#DIV/0!"}}]
[{"$f":"IF(E18>0,\"F\",\"\")","v":"F"},"2.",{"$f":"Orçamento!$P629","v":"ACESSIBILIDADE"},null,"UN ",1,{"$f":"IFERROR(Orçamento!S629,\"-\")","v":0},{"$f":"IFERROR(Orçamento!V629,\"\")","v":0},{"$f":"Orçamento!X629","v":{"$error":"#DIV/0!"}}]
["F","3.",{"$f":"Orçamento!$P630","v":"IMPLANTAÇÃO"},null,"UN ",1,{"$f":"IFERROR(Orçamento!S630,\"-\")","v":0},{"$f":"IFERROR(Orçamento!V630,\"\")","v":0},{"$f":"Orçamento!X630","v":{"$error":"#DIV/0!"}}]
["F","4.",{"$f":"Orçamento!$P631","v":"COZINHA SEDUC OPÇÃO 2"},null,"UN ",1,{"$f":"IFERROR(Orçamento!S631,\"-\")","v":0},{"$f":"IFERROR(Orçamento!V631,\"\")","v":0},{"$f":"Orçamento!X631","v":{"$error":"#DIV/0!"}}]
["F","5.",{"$f":"Orçamento!$P632","v":"BLOCO 01 SALA PADRÃO SEDUC 2017 - LAJE"},null,"UN ",1,{"$f":"IFERROR(Orçamento!S632,\"-\")","v":0},{"$f":"IFERROR(Orçamento!V632,\"\")","v":0},{"$f":"Orçamento!X632","v":{"$error":"#DIV/0!"}}]
["F","6.",{"$f":"Orçamento!$P633","v":"PASSARELA MODELO 02 - PADRÃO SÉC. XXI 2015"},null,"UN ",1,{"$f":"IFERROR(Orçamento!S633,\"-\")","v":0},{"$f":"IFERROR(Orçamento!V633,\"\")","v":0},{"$f":"Orçamento!X633","v":{"$error":"#DIV/0!"}}]
["","7.",{"$f":"Orçamento!$P634","v":""},null,null,null,{"$f":"IFERROR(Orçamento!S634,\"-\")","v":0},{"$f":"IFERROR(Orçamento!V634,\"\")","v":0},{"$f":"Orçamento!X634","v":{"$error":"#DIV/0!"}}]
["","8.",{"$f":"Orçamento!$P635","v":""},null,null,null,{"$f":"IFERROR(Orçamento!S635,\"-\")","v":0},{"$f":"IFERROR(Orçamento!V635,\"\")","v":0},{"$f":"Orçamento!X635","v":{"$error":"#DIV/0!"}}]
["","9.",{"$f":"Orçamento!$P636","v":""},null,null,null,{"$f":"IFERROR(Orçamento!S636,\"-\")","v":0},{"$f":"IFERROR(Orçamento!V636,\"\")","v":0},{"$f":"Orçamento!X636","v":{"$error":"#DIV/0!"}}]
["","10.",{"$f":"Orçamento!$P637","v":""},null,null,null,{"$f":"IFERROR(Orçamento!S637,\"-\")","v":0},{"$f":"IFERROR(Orçamento!V637,\"\")","v":0},{"$f":"Orçamento!X637","v":{"$error":"#DIV/0!"}}]
["","11.",{"$f":"Orçamento!$P638","v":""},null,null,null,{"$f":"IFERROR(Orçamento!S638,\"-\")","v":0},{"$f":"IFERROR(Orçamento!V638,\"\")","v":0},{"$f":"Orçamento!X638","v":{"$error":"#DIV/0!"}}]
["","12.",{"$f":"Orçamento!$P639","v":""},null,null,null,{"$f":"IFERROR(Orçamento!S639,\"-\")","v":0},{"$f":"IFERROR(Orçamento!V639,\"\")","v":0},{"$f":"Orçamento!X639","v":{"$error":"#DIV/0!"}}]
["","13.",{"$f":"Orçamento!$P640","v":""},null,null,null,{"$f":"IFERROR(Orçamento!S640,\"-\")","v":0},{"$f":"IFERROR(Orçamento!V640,\"\")","v":0},{"$f":"Orçamento!X640","v":{"$error":"#DIV/0!"}}]
["","14.",{"$f":"Orçamento!$P641","v":""},null,null,null,{"$f":"IFERROR(Orçamento!S641,\"-\")","v":0},{"$f":"IFERROR(Orçamento!V641,\"\")","v":0},{"$f":"Orçamento!X641","v":{"$error":"#DIV/0!"}}]
["","15.",{"$f":"Orçamento!$P642","v":""},null,null,null,{"$f":"IFERROR(Orçamento!S642,\"-\")","v":0},{"$f":"IFERROR(Orçamento!V642,\"\")","v":0},{"$f":"Orçamento!X642","v":{"$error":"#DIV/0!"}}]
["","16.",{"$f":"Orçamento!$P643","v":""},null,null,null,{"$f":"IFERROR(Orçamento!S643,\"-\")","v":0},{"$f":"IFERROR(Orçamento!V643,\"\")","v":0},{"$f":"Orçamento!X643","v":{"$error":"#DIV/0!"}}]
["","17.",{"$f":"Orçamento!$P644","v":""},null,null,null,{"$f":"IFERROR(Orçamento!S644,\"-\")","v":0},{"$f":"IFERROR(Orçamento!V644,\"\")","v":0},{"$f":"Orçamento!X644","v":{"$error":"#DIV/0!"}}]
["","18.",{"$f":"Orçamento!$P645","v":""},null,null,null,{"$f":"IFERROR(Orçamento!S645,\"-\")","v":0},{"$f":"IFERROR(Orçamento!V645,\"\")","v":0},{"$f":"Orçamento!X645","v":{"$error":"#DIV/0!"}}]
["","19.",{"$f":"Orçamento!$P646","v":""},null,null,null,{"$f":"IFERROR(Orçamento!S646,\"-\")","v":0},{"$f":"IFERROR(Orçamento!V646,\"\")","v":0},{"$f":"Orçamento!X646","v":{"$error":"#DIV/0!"}}]
["","20.",{"$f":"Orçamento!$P647","v":""},null,null,null,{"$f":"IFERROR(Orçamento!S647,\"-\")","v":0},{"$f":"IFERROR(Orçamento!V647,\"\")","v":0},{"$f":"Orçamento!X647","v":{"$error":"#DIV/0!"}}]
["F","TOTAL GERAL DO ORÇAMENTO (R$)",null,null,null,null,{"$f":"SUM(G17:G36)","v":0},0,{"$f":"SUM(I17:I36)","v":{"$error":"#DIV/0!"}}]
["F"]
["F"]

{"sheet":"Somatório","index":2,"n_rows":45,"n_cols":6,"rows_kept":45,"cut":false,"hidden":false,"merged":[[0,1,0,5],[14,1,14,5],[2,1,2,3],[2,4,2,5],[3,1,3,3],[3,4,3,5],[5,1,5,3],[5,4,5,5],[6,1,6,3],[6,4,6,5],[8,1,8,3],[8,4,8,5],[1,1,1,5],[4,1,4,5],[7,1,7,5],[10,1,10,5],[9,1,9,3],[9,4,9,5],[11,1,11,2],[11,4,11,5],[12,1,12,2],[12,4,12,5],[13,0,14,0],[42,1,42,2],[44,1,44,5],[47,3,47,5],[48,3,48,5],[13,1,13,5]]}
[]
[]
[null,"UNIDADE ESCOLAR",null,null,"CÓDIGO INEP"]
[null,{"$f":"Orçamento!$O$4","v":"COLÉGIO ESTADUAL ELVIRA LEÃO BARRETO"},null,null,{"$f":"Orçamento!V4","v":52042910}]
[]
[null,"OBRA",null,null,"CIDADE"]
[null,{"$f":"Orçamento!$O$7","v":"REFORMA"},null,null,{"$f":"Orçamento!$V$7","v":"SIMOLÂNDIA"}]
[]
[null,"ENDEREÇO",null,null,"CRE"]
[null,{"$f":"Orçamento!$R$10","v":"R HUMBERTO ALENCAR CASTELO BRANCO S/N, CENTRO, CEP:73930-000"},null,null,{"$f":"Orçamento!$O$10","v":"POSSE"}]
[]
[null,"REFERÊNCIA",null,"DATA","ÁREA TOTAL CONSTRUÍDA (M²)"]
[null,{"$f":"CONCATENATE(\"AGETOP E SINAPI - \",Orçamento!$W$10)","v":"AGETOP E SINAPI - DESONERADA"},null,{"$f":"Orçamento!$S$7","v":"2020-05-12"},{"$f":"Orçamento!$S$13","v":1267.68}]
["FILTRO"]
[null,"SOMATÓRIO DE SERVIÇOS"]
["↓","ITEM","DESCRIÇÃO DOS SERVIÇOS","PREÇO SEM BDI (R$)","PREÇO COM BDI (R$)","PARTIC.  ( % )"]
[{"$f":"IF(D17>0,\"F\",\"\")","v":""},"a.",{"$f":"Orçamento!P594","v":"SERVIÇOS PRELIMINARES"},{"$f":"Orçamento!S594","v":0},{"$f":"Orçamento!V594","v":0},{"$f":"Orçamento!X594","v":0}]
[{"$f":"IF(D18>0,\"F\",\"\")","v":""},"b.",{"$f":"Orçamento!P595","v":"TRANSPORTES"},{"$f":"Orçamento!S595","v":0},{"$f":"Orçamento!V595","v":0},{"$f":"Orçamento!X595","v":0}]
["","c.",{"$f":"Orçamento!P596","v":"SERVIÇO EM TERRA"},{"$f":"Orçamento!S596","v":0},{"$f":"Orçamento!V596","v":0},{"$f":"Orçamento!X596","v":0}]
["","d.",{"$f":"Orçamento!P597","v":"FUNDAÇÕES E SONDAGENS"},{"$f":"Orçamento!S597","v":0},{"$f":"Orçamento!V597","v":0},{"$f":"Orçamento!X597","v":0}]
["","e.",{"$f":"Orçamento!P598","v":"ESTRUTURA"},{"$f":"Orçamento!S598","v":0},{"$f":"Orçamento!V598","v":0},{"$f":"Orçamento!X598","v":0}]
["","f.",{"$f":"Orçamento!P599","v":"INSTALAÇÕES ELÉTRICAS"},{"$f":"Orçamento!S599","v":0},{"$f":"Orçamento!V599","v":0},{"$f":"Orçamento!X599","v":0}]
["","g.",{"$f":"Orçamento!P600","v":"INSTALAÇÕES HIDROSSANITÁRIAS"},{"$f":"Orçamento!S600","v":0},{"$f":"Orçamento!V600","v":0},{"$f":"Orçamento!X600","v":0}]
["","h.",{"$f":"Orçamento!P601","v":"INSTALAÇÕES ESPECIAIS"},{"$f":"Orçamento!S601","v":0},{"$f":"Orçamento!V601","v":0},{"$f":"Orçamento!X601","v":0}]
["","i.",{"$f":"Orçamento!P602","v":"ALVENARIAS E DIVISÓRIAS"},{"$f":"Orçamento!S602","v":0},{"$f":"Orçamento!V602","v":0},{"$f":"Orçamento!X602","v":0}]
["","j.",{"$f":"Orçamento!P603","v":"ALVENARIA AUTO-PORTANTE"},{"$f":"Orçamento!S603","v":0},{"$f":"Orçamento!V603","v":0},{"$f":"Orçamento!X603","v":0}]
["","k.",{"$f":"Orçamento!P604","v":"IMPERMEABILIZAÇÃO"},{"$f":"Orçamento!S604","v":0},{"$f":"Orçamento!V604","v":0},{"$f":"Orçamento!X604","v":0}]
["","l.",{"$f":"Orçamento!P605","v":"ISOLAMENTO TÉRMICO E ACÚSTICO"},{"$f":"Orçamento!S605","v":0},{"$f":"Orçamento!V605","v":0},{"$f":"Orçamento!X605","v":0}]
["","m.",{"$f":"Orçamento!P606","v":"ESTRUTURA DE MADEIRA"},{"$f":"Orçamento!S606","v":0},{"$f":"Orçamento!V606","v":0},{"$f":"Orçamento!X606","v":0}]
["","n.",{"$f":"Orçamento!P607","v":"ESTRUTURAS METÁLICAS"},{"$f":"Orçamento!S607","v":0},{"$f":"Orçamento!V607","v":0},{"$f":"Orçamento!X607","v":0}]
["","o.",{"$f":"Orçamento!P608","v":"COBERTURAS"},{"$f":"Orçamento!S608","v":0},{"$f":"Orçamento!V608","v":0},{"$f":"Orçamento!X608","v":0}]
["","p.",{"$f":"Orçamento!P609","v":"ESQUADRIAS DE MADEIRA"},{"$f":"Orçamento!S609","v":0},{"$f":"Orçamento!V609","v":0},{"$f":"Orçamento!X609","v":0}]
["","q.",{"$f":"Orçamento!P610","v":"ESQUADRIAS METÁLICAS"},{"$f":"Orçamento!S610","v":0},{"$f":"Orçamento!V610","v":0},{"$f":"Orçamento!X610","v":0}]
["","r.",{"$f":"Orçamento!P611","v":"VIDROS"},{"$f":"Orçamento!S611","v":0},{"$f":"Orçamento!V611","v":0},{"$f":"Orçamento!X611","v":0}]
["","s.",{"$f":"Orçamento!P612","v":"REVESTIMENTO DE PAREDE"},{"$f":"Orçamento!S612","v":0},{"$f":"Orçamento!V612","v":0},{"$f":"Orçamento!X612","v":0}]
["","t.",{"$f":"Orçamento!P613","v":"FORROS"},{"$f":"Orçamento!S613","v":0},{"$f":"Orçamento!V613","v":0},{"$f":"Orçamento!X613","v":0}]
["","u.",{"$f":"Orçamento!P614","v":"REVESTIMENTO DE PISO"},{"$f":"Orçamento!S614","v":0},{"$f":"Orçamento!V614","v":0},{"$f":"Orçamento!X614","v":0}]
["","v.",{"$f":"Orçamento!P615","v":"FERRAGENS"},{"$f":"Orçamento!S615","v":0},{"$f":"Orçamento!V615","v":0},{"$f":"Orçamento!X615","v":0}]
["","w.",{"$f":"Orçamento!P616","v":"MARCENARIA"},{"$f":"Orçamento!S616","v":0},{"$f":"Orçamento!V616","v":0},{"$f":"Orçamento!X616","v":0}]
["","x.",{"$f":"Orçamento!P617","v":"ADMINISTRAÇÃO"},{"$f":"Orçamento!S617","v":0},{"$f":"Orçamento!V617","v":0},{"$f":"Orçamento!X617","v":0}]
["","y.",{"$f":"Orçamento!P618","v":"PINTURA"},{"$f":"Orçamento!S618","v":0},{"$f":"Orçamento!V618","v":0},{"$f":"Orçamento!X618","v":0}]
["","z.",{"$f":"Orçamento!P619","v":"DIVERSOS"},{"$f":"Orçamento!S619","v":0},{"$f":"Orçamento!V619","v":0},{"$f":"Orçamento!X619","v":0}]
["F","TOTAL GERAL DO ORÇAMENTO",null,{"$f":"SUM(D17:D42)","v":0},{"$f":"SUM(E17:E42)","v":0},{"$f":"SUM(F17:F42)","v":0}]
[]
[null,"(*) Para itens da AGETOP, os vidros não estão inclusos nas esquadrias e já foram considerados os custos de contramarco para as esquadrias de alumínio;"]

{"sheet":"Cronog_60_Dias","index":3,"n_rows":99,"n_cols":14,"rows_kept":99,"cut":false,"hidden":false,"merged":[[10,1,10,13],[9,8,9,13],[8,8,8,13],[3,8,3,13],[6,8,6,13],[5,8,5,13],[3,1,3,7],[56,4,58,4],[29,3,31,3],[35,1,37,2],[35,4,37,4],[50,3,52,3],[53,3,55,3],[12,13,13,13],[13,1,13,2],[13,5,13,8],[13,9,13,12],[12,3,13,3],[12,9,12,12],[14,1,16,2],[12,5,12,8],[17,1,19,2],[17,4,19,4],[17,5,17,8],[56,1,58,2],[68,4,70,4],[44,3,46,3],[62,1,64,2],[62,4,64,4],[38,1,40,2],[38,4,40,4],[59,3,61,3],[44,1,46,2],[44,4,46,4],[53,1,55,2],[50,1,52,2],[50,4,52,4],[20,1,22,2],[20,4,22,4],[20,5,20,8],[20,9,20,12],[22,5,22,8],[22,9,22,12],[20,3,22,3],[83,3,85,3],[53,4,55,4],[59,1,61,2],[59,4,61,4],[74,1,76,2],[77,1,79,2],[77,4,79,4],[80,1,82,2],[65,1,67,2],[68,3,70,3],[62,3,64,3],[68,1,70,2],[56,3,58,3],[65,4,67,4],[71,3,73,3],[74,3,76,3],[74,4,76,4],[14,3,16,3],[17,3,19,3],[14,4,16,4],[14,5,14,8],[14,9,14,12],[16,5,16,8],[16,9,16,12],[23,9,23,12],[25,5,25,8],[25,9,25,12],[17,9,17,12],[19,5,19,8],[19,9,19,12],[26,1,28,2],[26,4,28,4],[26,5,26,8],[26,9,26,12],[28,5,28,8],[28,9,28,12],[23,3,25,3],[23,1,25,2],[23,4,25,4],[23,5,23,8],[26,3,28,3],[29,9,29,12],[31,5,31,8],[31,9,31,12],[32,1,34,2],[32,4,34,4],[32,5,32,8],[32,9,32,12],[34,5,34,8],[34,9,34,12],[32,3,34,3],[29,5,29,8],[29,1,31,2],[29,4,31,4],[35,9,35,12],[37,5,37,8],[37,9,37,12],[35,3,37,3],[40,9,40,12],[38,3,40,3],[38,9,38,12],[41,1,43,2],[41,4,43,4],[41,5,41,8],[41,9,41,12],[43,5,43,8],[43,9,43,12],[41,3,43,3],[35,5,35,8],[38,5,38,8],[40,5,40,8],[44,9,44,12],[46,5,46,8],[46,9,46,12],[47,1,49,2],[47,4,49,4],[47,5,47,8],[47,9,47,12],[49,5,49,8],[49,9,49,12],[44,5,44,8],[47,3,49,3],[53,9,53,12],[55,5,55,8],[55,9,55,12],[50,5,50,8],[50,9,50,12],[52,5,52,8],[52,9,52,12],[56,9,56,12],[58,5,58,8],[58,9,58,12],[53,5,53,8],[56,5,56,8],[68,5,68,8],[65,5,65,8],[65,9,65,12],[67,5,67,8],[67,9,67,12],[65,3,67,3],[62,9,62,12],[64,5,64,8],[64,9,64,12],[62,5,62,8],[95,1,95,2],[95,5,95,8],[95,9,95,12],[97,1,97,4],[98,1,98,13],[86,9,86,12],[88,5,88,8],[88,9,88,12],[85,5,85,8],[85,9,85,12],[89,1,91,2],[89,4,91,4],[89,5,89,8],[89,9,89,12],[91,5,91,8],[91,9,91,12],[89,3,91,3],[86,4,88,4],[86,5,86,8],[86,3,88,3],[83,1,85,2],[83,4,85,4],[83,5,83,8],[83,9,83,12],[94,1,94,2],[94,5,94,8],[94,9,94,12],[76,5,76,8],[76,9,76,12],[77,5,77,8],[77,9,77,12],[79,5,79,8],[79,9,79,12],[80,5,80,8],[80,9,80,12],[82,5,82,8],[82,9,82,12],[77,3,79,3],[80,3,82,3],[86,1,88,2],[80,4,82,4],[12,0,13,0],[9,0,11,0],[11,1,11,13],[92,1,92,2],[92,5,92,8],[92,9,92,12],[93,1,93,2],[93,5,93,8],[93,9,93,12],[74,9,74,12],[74,5,74,8],[68,9,68,12],[70,5,70,8],[70,9,70,12],[59,5,59,8],[71,1,73,2],[71,4,73,4],[71,5,71,8],[71,9,71,12],[73,5,73,8],[73,9,73,12],[59,9,59,12],[61,5,61,8],[61,9,61,12],[2,1,2,7],[5,1,5,7],[6,1,6,7],[8,1,8,7],[9,1,9,7],[4,1,4,13],[7,1,7,13],[0,1,0,13],[1,1,1,13],[2,8,2,13]]}
[]
[]
[null,"UNIDADE ESCOLAR",null,null,null,null,null,null,"PRAZO"]
[null,{"$f":"Orçamento!$O$4","v":"COLÉGIO ESTADUAL ELVIRA LEÃO BARRETO"},null,null,null,null,null,null,"60 DIAS CORRIDOS"]
[]
[null,"OBRA",null,null,null,null,null,null,"DATA"]
[null,{"$f":"Orçamento!$O$7","v":"REFORMA"},null,null,null,null,null,null,{"$f":"Orçamento!$S$7","v":"2020-05-12"}]
[]
[null,"LOCAL",null,null,null,null,null,null,"ÁREA TOTAL CONSTRUÍDA (M²)"]
["FILTRO",{"$f":"Orçamento!$V$7","v":"SIMOLÂNDIA"},null,null,null,null,null,null,{"$f":"Orçamento!$S$13","v":1267.68}]
[]
[null,"CRONOGRAMA - FÍSICO FINANCEIRO"]
["↓","CUSTO TOTAL:",{"$f":"D93","v":0},"VALOR","Dias:",30,null,null,null,60,null,null,null,"TOTAL"]
[null,"DESCRIÇÃO DOS SERVIÇOS",null,null,"%","1ª PARCELA",null,null,null,"2ª PARCELA"]
[{"$f":"IF(D15>0,\"F\",\"\")","v":""},"SERVIÇOS PRELIMINARES",null,{"$f":"Orçamento!V594","v":0},{"$f":"Orçamento!X594","v":0},{"$f":"ROUND(F17*$D$15,2)","v":0},null,null,null,{"$f":"ROUND(J17*$D$15,2)","v":0},null,null,null,{"$f":"SUM(F15:M15)","v":0}]
[{"$f":"IF(A15=\"F\",A15,\"\")","v":""}]
[{"$f":"IF(A16=\"F\",A16,\"\")","v":""},null,null,null,null,1,null,null,null,{"$f":"1-F17","v":0},null,null,null,{"$f":"IFERROR(E15/100,\"\")","v":0}]
[{"$f":"IF(D18>0,\"F\",\"\")","v":""},"TRANSPORTES",null,{"$f":"Orçamento!V595","v":0},{"$f":"Orçamento!X595","v":0},{"$f":"ROUND(F20*$D$18,2)","v":0},null,null,null,{"$f":"ROUND(J20*$D$18,2)","v":0},null,null,null,{"$f":"SUM(F18:M18)","v":0}]
[{"$f":"IF(A18=\"F\",A18,\"\")","v":""}]
[{"$f":"IF(A19=\"F\",A19,\"\")","v":""},null,null,null,null,0.48,null,null,null,{"$f":"1-F20","v":0.52},null,null,null,{"$f":"IFERROR(E18/100,\"\")","v":0}]
[{"$f":"IF(D21>0,\"F\",\"\")","v":""},"SERVIÇO EM TERRA",null,{"$f":"Orçamento!V596","v":0},{"$f":"Orçamento!X596","v":0},{"$f":"ROUND(F23*$D$21,2)","v":0},null,null,null,{"$f":"ROUND(J23*$D$21,2)","v":0},null,null,null,{"$f":"SUM(F21:M21)","v":0}]
[{"$f":"IF(A21=\"F\",A21,\"\")","v":""}]
[{"$f":"IF(A22=\"F\",A22,\"\")","v":""},null,null,null,null,1,null,null,null,{"$f":"1-F23","v":0},null,null,null,{"$f":"IFERROR(E21/100,\"\")","v":0}]
[{"$f":"IF(D24>0,\"F\",\"\")","v":""},"FUNDAÇÕES E SONDAGENS",null,{"$f":"Orçamento!V597","v":0},{"$f":"Orçamento!X597","v":0},{"$f":"ROUND(F26*$D$24,2)","v":0},null,null,null,{"$f":"ROUND(J26*$D$24,2)","v":0},null,null,null,{"$f":"SUM(F24:M24)","v":0}]
[{"$f":"IF(A24=\"F\",A24,\"\")","v":""}]
[{"$f":"IF(A25=\"F\",A25,\"\")","v":""},null,null,null,null,1,null,null,null,{"$f":"1-F26","v":0},null,null,null,{"$f":"IFERROR(E24/100,\"\")","v":0}]
[{"$f":"IF(D27>0,\"F\",\"\")","v":""},"ESTRUTURA",null,{"$f":"Orçamento!V598","v":0},{"$f":"Orçamento!X598","v":0},{"$f":"ROUND(F29*$D$27,2)","v":0},null,null,null,{"$f":"ROUND(J29*$D$27,2)","v":0},null,null,null,{"$f":"SUM(F27:M27)","v":0}]
[{"$f":"IF(A27=\"F\",A27,\"\")","v":""}]
[{"$f":"IF(A28=\"F\",A28,\"\")","v":""},null,null,null,null,0.49,null,null,null,{"$f":"1-F29","v":0.51},null,null,null,{"$f":"IFERROR(E27/100,\"\")","v":0}]
[{"$f":"IF(D30>0,\"F\",\"\")","v":""},"INST.ELET/TELEFÔNICA/CABEAMENTO ESTRUTURADO",null,{"$f":"Orçamento!V599","v":0},{"$f":"Orçamento!X599","v":0},{"$f":"ROUND(F32*$D$30,2)","v":0},null,null,null,{"$f":"ROUND(J32*$D$30,2)","v":0},null,null,null,{"$f":"SUM(F30:M30)","v":0}]
[{"$f":"IF(A30=\"F\",A30,\"\")","v":""}]
[{"$f":"IF(A31=\"F\",A31,\"\")","v":""},null,null,null,null,0.4,null,null,null,{"$f":"1-F32","v":0.6},null,null,null,{"$f":"IFERROR(E30/100,\"\")","v":0}]
[{"$f":"IF(D33>0,\"F\",\"\")","v":""},"INSTALAÇÕES HIDROSSANITÁRIAS",null,{"$f":"Orçamento!V600","v":0},{"$f":"Orçamento!X600","v":0},{"$f":"ROUND(F35*$D$33,2)","v":0},null,null,null,{"$f":"ROUND(J35*$D$33,2)","v":0},null,null,null,{"$f":"SUM(F33:M33)","v":0}]
[{"$f":"IF(A33=\"F\",A33,\"\")","v":""}]
[{"$f":"IF(A34=\"F\",A34,\"\")","v":""},null,null,null,null,0.48,null,null,null,{"$f":"1-F35","v":0.52},null,null,null,{"$f":"IFERROR(E33/100,\"\")","v":0}]
[{"$f":"IF(D36>0,\"F\",\"\")","v":""},"INSTALAÇÕES ESPECIAIS",null,{"$f":"Orçamento!V601","v":0},{"$f":"Orçamento!X601","v":0},{"$f":"ROUND(F38*$D$36,2)","v":0},null,null,null,{"$f":"ROUND(J38*$D$36,2)","v":0},null,null,null,{"$f":"SUM(F36:M36)","v":0}]
[{"$f":"IF(A36=\"F\",A36,\"\")","v":""}]
[{"$f":"IF(A37=\"F\",A37,\"\")","v":""},null,null,null,null,1,null,null,null,{"$f":"1-F38","v":0},null,null,null,{"$f":"IFERROR(E36/100,\"\")","v":0}]
[{"$f":"IF(D39>0,\"F\",\"\")","v":""},"ALVENARIA E DIVISÓRIAS",null,{"$f":"Orçamento!V602","v":0},{"$f":"Orçamento!X602","v":0},{"$f":"ROUND(F41*$D$39,2)","v":0},null,null,null,{"$f":"ROUND(J41*$D$39,2)","v":0},null,null,null,{"$f":"SUM(F39:M39)","v":0}]
[{"$f":"IF(A39=\"F\",A39,\"\")","v":""}]
[{"$f":"IF(A40=\"F\",A40,\"\")","v":""},null,null,null,null,1,null,null,null,{"$f":"1-F41","v":0},null,null,null,{"$f":"IFERROR(E39/100,\"\")","v":0}]
[{"$f":"IF(D42>0,\"F\",\"\")","v":""},"ALVENARIA AUTO-PORTANTE",null,{"$f":"Orçamento!V603","v":0},{"$f":"Orçamento!X603","v":0},{"$f":"ROUND(F44*$D$42,2)","v":0},null,null,null,{"$f":"ROUND(J44*$D$42,2)","v":0},null,null,null,{"$f":"SUM(F42:M42)","v":0}]
[{"$f":"IF(A42=\"F\",A42,\"\")","v":""}]
[{"$f":"IF(A43=\"F\",A43,\"\")","v":""},null,null,null,null,1,null,null,null,{"$f":"1-F44","v":0},null,null,null,{"$f":"IFERROR(E42/100,\"\")","v":0}]
[{"$f":"IF(D45>0,\"F\",\"\")","v":""},"IMPERMEABILIZAÇÃO",null,{"$f":"Orçamento!V604","v":0},{"$f":"Orçamento!X604","v":0},{"$f":"ROUND(F47*$D$45,2)","v":0},null,null,null,{"$f":"ROUND(J47*$D$45,2)","v":0},null,null,null,{"$f":"SUM(F45:M45)","v":0}]
[{"$f":"IF(A45=\"F\",A45,\"\")","v":""}]
[{"$f":"IF(A46=\"F\",A46,\"\")","v":""},null,null,null,null,1,null,null,null,{"$f":"1-F47","v":0},null,null,null,{"$f":"IFERROR(E45/100,\"\")","v":0}]
[{"$f":"IF(D48>0,\"F\",\"\")","v":""},"ISOLAMENTO TÉRMICO E ACÚSTICO",null,{"$f":"Orçamento!V605","v":0},{"$f":"Orçamento!X605","v":0},{"$f":"ROUND(F50*$D$48,2)","v":0},null,null,null,{"$f":"ROUND(J50*$D$48,2)","v":0},null,null,null,{"$f":"SUM(F48:M48)","v":0}]
[{"$f":"IF(A48=\"F\",A48,\"\")","v":""}]
[{"$f":"IF(A49=\"F\",A49,\"\")","v":""},null,null,null,null,0.5,null,null,null,{"$f":"1-F50","v":0.5},null,null,null,{"$f":"IFERROR(E48/100,\"\")","v":0}]
[{"$f":"IF(D51>0,\"F\",\"\")","v":""},"ESTRUTURA DE MADEIRA",null,{"$f":"Orçamento!V606","v":0},{"$f":"Orçamento!X606","v":0},{"$f":"ROUND(F53*$D$51,2)","v":0},null,null,null,{"$f":"ROUND(J53*$D$51,2)","v":0},null,null,null,{"$f":"SUM(F51:M51)","v":0}]
[{"$f":"IF(A51=\"F\",A51,\"\")","v":""}]
[{"$f":"IF(A52=\"F\",A52,\"\")","v":""},null,null,null,null,0.4,null,null,null,{"$f":"1-F53","v":0.6},null,null,null,{"$f":"IFERROR(E51/100,\"\")","v":0}]
[{"$f":"IF(D54>0,\"F\",\"\")","v":""},"ESTRUTURA METÁLICA",null,{"$f":"Orçamento!V607","v":0},{"$f":"Orçamento!X607","v":0},{"$f":"ROUND(F56*$D$54,2)","v":0},null,null,null,{"$f":"ROUND(J56*$D$54,2)","v":0},null,null,null,{"$f":"SUM(F54:M54)","v":0}]
[{"$f":"IF(A54=\"F\",A54,\"\")","v":""}]
[{"$f":"IF(A55=\"F\",A55,\"\")","v":""},null,null,null,null,0.35,null,null,null,{"$f":"1-F56","v":0.65},null,null,null,{"$f":"IFERROR(E54/100,\"\")","v":0}]
[{"$f":"IF(D57>0,\"F\",\"\")","v":""},"COBERTURAS",null,{"$f":"Orçamento!V608","v":0},{"$f":"Orçamento!X608","v":0},{"$f":"ROUND(F59*$D$57,2)","v":0},null,null,null,{"$f":"ROUND(J59*$D$57,2)","v":0},null,null,null,{"$f":"SUM(F57:M57)","v":0}]
[{"$f":"IF(A57=\"F\",A57,\"\")","v":""}]
[{"$f":"IF(A58=\"F\",A58,\"\")","v":""},null,null,null,null,0,null,null,null,{"$f":"1-F59","v":1},null,null,null,{"$f":"IFERROR(E57/100,\"\")","v":0}]
[{"$f":"IF(D60>0,\"F\",\"\")","v":""},"ESQUADRIAS DE MADEIRA",null,{"$f":"Orçamento!V609","v":0},{"$f":"Orçamento!X609","v":0},{"$f":"ROUND(F62*$D$60,2)","v":0},null,null,null,{"$f":"ROUND(J62*$D$60,2)","v":0},null,null,null,{"$f":"SUM(F60:M60)","v":0}]
[{"$f":"IF(A60=\"F\",A60,\"\")","v":""}]
[{"$f":"IF(A61=\"F\",A61,\"\")","v":""},null,null,null,null,0.54,null,null,null,{"$f":"1-F62","v":0.45999999999999996},null,null,null,{"$f":"IFERROR(E60/100,\"\")","v":0}]
[{"$f":"IF(D63>0,\"F\",\"\")","v":""},"ESQUADRIAS METÁLICAS",null,{"$f":"Orçamento!V610","v":0},{"$f":"Orçamento!X610","v":0},{"$f":"ROUND(F65*$D$63,2)","v":0},null,null,null,{"$f":"ROUND(J65*$D$63,2)","v":0},null,null,null,{"$f":"SUM(F63:M63)","v":0}]
[{"$f":"IF(A63=\"F\",A63,\"\")","v":""}]
[{"$f":"IF(A64=\"F\",A64,\"\")","v":""},null,null,null,null,0.49,null,null,null,{"$f":"1-F65","v":0.51},null,null,null,{"$f":"IFERROR(E63/100,\"\")","v":0}]
[{"$f":"IF(D66>0,\"F\",\"\")","v":""},"VIDROS",null,{"$f":"Orçamento!V611","v":0},{"$f":"Orçamento!X611","v":0},{"$f":"ROUND(F68*$D$66,2)","v":0},null,null,null,{"$f":"ROUND(J68*$D$66,2)","v":0},null,null,null,{"$f":"SUM(F66:M66)","v":0}]
[{"$f":"IF(A66=\"F\",A66,\"\")","v":""}]
[{"$f":"IF(A67=\"F\",A67,\"\")","v":""},null,null,null,null,0,null,null,null,{"$f":"1-F68","v":1},null,null,null,{"$f":"IFERROR(E66/100,\"\")","v":0}]
[{"$f":"IF(D69>0,\"F\",\"\")","v":""},"REVESTIMENTO DE PAREDE",null,{"$f":"Orçamento!V612","v":0},{"$f":"Orçamento!X612","v":0},{"$f":"ROUND(F71*$D$69,2)","v":0},null,null,null,{"$f":"ROUND(J71*$D$69,2)","v":0},null,null,null,{"$f":"SUM(F69:M69)","v":0}]
[{"$f":"IF(A69=\"F\",A69,\"\")","v":""}]
[{"$f":"IF(A70=\"F\",A70,\"\")","v":""},null,null,null,null,0.32,null,null,null,{"$f":"1-F71","v":0.67999999999999994},null,null,null,{"$f":"IFERROR(E69/100,\"\")","v":0}]
[{"$f":"IF(D72>0,\"F\",\"\")","v":""},"FORROS",null,{"$f":"Orçamento!V613","v":0},{"$f":"Orçamento!X613","v":0},{"$f":"ROUND(F74*$D$72,2)","v":0},null,null,null,{"$f":"ROUND(J74*$D$72,2)","v":0},null,null,null,{"$f":"SUM(F72:M72)","v":0}]
[{"$f":"IF(A72=\"F\",A72,\"\")","v":""}]
[{"$f":"IF(A73=\"F\",A73,\"\")","v":""},null,null,null,null,0.24,null,null,null,{"$f":"1-F74","v":0.76},null,null,null,{"$f":"IFERROR(E72/100,\"\")","v":0}]
[{"$f":"IF(D75>0,\"F\",\"\")","v":""},"REVESTIMENTO DE PISO",null,{"$f":"Orçamento!V614","v":0},{"$f":"Orçamento!X614","v":0},{"$f":"ROUND(F77*$D$75,2)","v":0},null,null,null,{"$f":"ROUND(J77*$D$75,2)","v":0},null,null,null,{"$f":"SUM(F75:M75)","v":0}]
[{"$f":"IF(A75=\"F\",A75,\"\")","v":""}]
[{"$f":"IF(A76=\"F\",A76,\"\")","v":""},null,null,null,null,0.49,null,null,null,{"$f":"1-F77","v":0.51},null,null,null,{"$f":"IFERROR(E75/100,\"\")","v":0}]
[{"$f":"IF(D78>0,\"F\",\"\")","v":""},"FERRAGENS",null,{"$f":"Orçamento!V615","v":0},{"$f":"Orçamento!X615","v":0},{"$f":"ROUND(F80*$D$78,2)","v":0},null,null,null,{"$f":"ROUND(J80*$D$78,2)","v":0},null,null,null,{"$f":"SUM(F78:M78)","v":0}]
[{"$f":"IF(A78=\"F\",A78,\"\")","v":""}]
[{"$f":"IF(A79=\"F\",A79,\"\")","v":""},null,null,null,null,0,null,null,null,{"$f":"1-F80","v":1},null,null,null,{"$f":"IFERROR(E78/100,\"\")","v":0}]
[{"$f":"IF(D81>0,\"F\",\"\")","v":""},"MARCENARIA",null,{"$f":"Orçamento!V616","v":0},{"$f":"Orçamento!X616","v":0},{"$f":"ROUND(F83*$D$81,2)","v":0},null,null,null,{"$f":"ROUND(J83*$D$81,2)","v":0},null,null,null,{"$f":"SUM(F81:M81)","v":0}]
[{"$f":"IF(A81=\"F\",A81,\"\")","v":""}]
[{"$f":"IF(A82=\"F\",A82,\"\")","v":""},null,null,null,null,0.4,null,null,null,{"$f":"1-F83","v":0.6},null,null,null,{"$f":"IFERROR(E81/100,\"\")","v":0}]
[{"$f":"IF(D84>0,\"F\",\"\")","v":""},"ADMINISTRAÇÃO - MENSALISTAS",null,{"$f":"Orçamento!V617","v":0},{"$f":"Orçamento!X617","v":0},{"$f":"ROUND(F86*$D$84,2)","v":0},null,null,null,{"$f":"ROUND(J86*$D$84,2)","v":0},null,null,null,{"$f":"SUM(F84:M84)","v":0}]
[{"$f":"IF(A84=\"F\",A84,\"\")","v":""}]
[{"$f":"IF(A85=\"F\",A85,\"\")","v":""},null,null,null,null,0.49,null,null,null,{"$f":"1-F86","v":0.51},null,null,null,{"$f":"IFERROR(E84/100,\"\")","v":0}]
[{"$f":"IF(D87>0,\"F\",\"\")","v":""},"PINTURA",null,{"$f":"Orçamento!V618","v":0},{"$f":"Orçamento!X618","v":0},{"$f":"ROUND(F89*$D$87,2)","v":0},null,null,null,{"$f":"ROUND(J89*$D$87,2)","v":0},null,null,null,{"$f":"SUM(F87:M87)","v":0}]
[{"$f":"IF(A87=\"F\",A87,\"\")","v":""}]
[{"$f":"IF(A88=\"F\",A88,\"\")","v":""},null,null,null,null,0,null,null,null,{"$f":"1-F89","v":1},null,null,null,{"$f":"IFERROR(E87/100,\"\")","v":0}]
[{"$f":"IF(D90>0,\"F\",\"\")","v":""},"DIVERSOS",null,{"$f":"Orçamento!V619","v":0},{"$f":"Orçamento!X619","v":0},{"$f":"ROUND(F92*$D$90,2)","v":0},null,null,null,{"$f":"ROUND(J92*$D$90,2)","v":0},null,null,null,{"$f":"SUM(F90:M90)","v":0}]
[{"$f":"IF(A90=\"F\",A90,\"\")","v":""}]
[{"$f":"IF(A91=\"F\",A91,\"\")","v":""},null,null,null,null,0.46,null,null,null,{"$f":"1-F92","v":0.54},null,null,null,{"$f":"IFERROR(E90/100,\"\")","v":0}]
["F","CUSTO DO ORÇAMENTO",null,{"$f":"SUM(D15:D92)","v":0},{"$f":"SUM(E15:E92)","v":0},{"$f":"F15+F18+F21+F24+F27+F30+F33+F36+F39+F42+F45+F48+F51+F54+F57+F60+F63+F66+F69+F72+F75+F78+F81+F84+F87+F90","v":0},null,null,null,{"$f":"J15+J18+J21+J24+J27+J30+J33+J36+J39+J42+J45+J48+J51+J54+J57+J60+J63+J66+J69+J72+J75+J78+J81+J84+J87+J90","v":0},null,null,null,{"$f":"N15+N18+N21+N24+N27+N30+N33+N36+N39+N42+N45+N48+N51+N54+N57+N60+N63+N66+N69+N72+N75+N78+N81+N84+N87+N90","v":0}]
["F","PERCENTUAIS:",null,null,null,{"$f":"IFERROR(F93/D93,\"\")","v":""},null,null,null,{"$f":"IFERROR(J93/D93,\"\")","v":""},null,null,null,{"$f":"SUM(F94:M94)","v":0}]
["F","TOTAIS ACUMULADOS:",null,null,null,{"$f":"F93","v":0},null,null,null,{"$f":"F95+J93","v":0}]
["F","PERCENTUAIS  ACUMULADOS:",null,null,null,{"$f":"F94","v":""},null,null,null,{"$f":"IFERROR(F96+J94,\"\")","v":""}]
["F"]
["F","OBSERVAÇÕES:"]
["F","Os pagamentos somente poderão ser efetuados mediante medição e atesto pelos técnicos da Secretaria da Educação. "]

{"sheet":"Composição BDI","index":4,"n_rows":45,"n_cols":9,"rows_kept":45,"cut":false,"hidden":false,"merged":[[18,5,18,8],[17,0,17,3],[16,0,16,3],[44,0,44,3],[42,0,42,3],[43,0,43,3],[18,0,18,3],[36,0,36,3],[39,0,39,3],[38,0,38,3],[40,0,40,3],[29,0,29,2],[32,0,32,3],[33,0,33,3],[34,0,34,3],[35,0,35,3],[0,0,0,3],[1,0,1,3],[4,0,4,3],[7,0,7,3],[10,0,10,3],[2,0,2,3],[3,0,3,3],[5,0,5,3],[6,0,6,3],[8,0,8,3],[9,0,9,3],[11,0,11,3],[12,0,12,3],[14,0,14,3],[15,0,15,3],[13,0,13,3]]}
[]
[]
["UNIDADE ESCOLAR"]
[{"$f":"Orçamento!$O$4","v":"COLÉGIO ESTADUAL ELVIRA LEÃO BARRETO"}]
[]
["OBRA"]
[{"$f":"Orçamento!$O$7","v":"REFORMA"}]
[]
["ENDEREÇO"]
[{"$f":"Orçamento!$R$10","v":"R HUMBERTO ALENCAR CASTELO BRANCO S/N, CENTRO, CEP:73930-000"}]
[]
["CIDADE"]
[{"$f":"Orçamento!$V$7","v":"SIMOLÂNDIA"}]
[]
["CRE"]
[{"$f":"Orçamento!$O$10","v":"POSSE"}]
[]
["DETALHAMENTO DA COMPOSIÇÃO DE BDI"]
["COMPOSIÇÃO BDI PARA OBRAS CIVIS",null,null,null,null,"BDI CONSTRUÇÃO E REFORMA"]
["DESCRIÇÃO","COEF.","TAXA % (a.m)","% no preço de venda",null,"Situação","1º Quartil","Médio","3º Quartil"]
["1) COFINS",1,0.03,{"$f":"C21","v":0.03},null,{"$f":"IF(OR(C21<G21,C21>I21),\"FORA DO INTERVALO\",\"OK\")","v":"OK"},0.03,0.03,0.03]
["2) PIS",1,6.4999999999999997E-3,{"$f":"C22","v":6.4999999999999997E-3},null,{"$f":"IF(OR(C22<G22,C22>I22),\"FORA DO INTERVALO\",\"OK\")","v":"OK"},6.4999999999999997E-3,6.4999999999999997E-3,6.4999999999999997E-3]
["3) ISSQN",1,1.4999999999999999E-2,{"$f":"C23*B23","v":1.4999999999999999E-2},null,"FORA DO INTERVALO",0.02,3.5000000000000003E-2,0.05]
["4) CPRB",1,4.4999999999999998E-2,{"$f":"C24","v":4.4999999999999998E-2},null,"OK",4.4999999999999998E-2,4.4999999999999998E-2,4.4999999999999998E-2]
["5) Administração Central",1,0.04,0.04,null,"OK",0.03,0.04,5.5E-2]
["6) Despesas Financeiras",1,5.5999999999999999E-3,5.5999999999999999E-3,null,"FORA DO INTERVALO",5.8999999999999999E-3,1.23E-2,1.3899999999999999E-2]
["7) Seguros + Garantias",1,1.1999999999999999E-3,1.1999999999999999E-3,null,"FORA DO INTERVALO",8.0000000000000002E-3,8.0000000000000002E-3,0.01]
["8) Risco",1,9.7000000000000003E-3,9.7000000000000003E-3,null,"OK",9.7000000000000003E-3,1.2699999999999999E-2,1.2699999999999999E-2]
["9) Lucro",1,7.1999999999999995E-2,7.1999999999999995E-2,null,"OK",6.1600000000000002E-2,7.3999999999999996E-2,8.9599999999999999E-2]
["BDI - FINAL",null,null,{"$f":"(((1+D25+D27+D28)*(1+D26)*(1+D29))/(1-(D21+D22+D23+D24))-1)","v":0.25387223340343157},null,{"$f":"IF(OR(D30<G30,D30>I30),\"FORA DO INTERVALO\",\"OK\")","v":"FORA DO INTERVALO"},0.2034,0.22120000000000001,0.25]
[]
["Notas:"]
["(1) e (2) Alíquota definida por lei."]
["(3) Alíquota e base de cálculo definidas pela legislação municipal."]
["(4) Alíquota definida pelas leis 12.546/11, 12844/13 e 13.161/15 (CPRB – contribuição previdenciária sobre a receita bruta)."]
["(5) Valores definidos a partir dos limites no Acórdão nº 2.622/2013 - TCU – Plenário. Valores entre o 1º e 3º quartis."]
["(6) Valor calculado pela expressão matemática do acórdão 2.369/2011 – TCU – Plenário e disponibilizado pela AGETOP em dezembro de 2018. (Foi utilizado para o cálculo a média da Taxa SELIC no período de 11/2017 a 10/2018)"]
[]
["(7) Valores definidos pela AGETOP a partir dos limites no Acórdão nº 2.622/2013 - TCU – Plenário. Valores médios. \n\nObservação da AGETOP: (Seguros contra erros de execução, incêndio e explosão, danos da natureza (vendaval, destelhamento, alagamento, inundação, desmoronamento, geadas etc.), emprego de material defeituoso ou inadequado, roubo e/ou furto qualificado, quebra de equipamentos, desmoronamento de estrutura, nas modalidades de Obras Civis em Construção (OCC); Instalação e Montagem (IM); e Obras Civis em Construção e Instalação e Montagem (OCC/IM). Bem como coberturas adicionais para ampliação dessas coberturas básicas, como: cobertura de responsabilidade civil geral, cobertura de responsabilidade civil cruzada, cobertura de despesas extraordinárias, cobertura de tumultos, cobertura de desentulho do local, cobertura de riscos do fabricante, dentre outras, incluindo o seguro de vida em grupo regido pela convenção coletiva dos trabalhadores na indústria da construção civil). A partir de 24/02/2015 por intermédio da Portaria 449/2015 a Presidência da AGETOP, na pessoa do Senhor Jayme Eduardo Rincon, determinou a exclusão dos valores referentes aos Seguros de Risco de Engenharia e Responsabilidade Civil do Profissional na composição do cálculo do B.D.I.."]
["(8) Valores definidos a partir dos limites no Acórdão nº 2.622/2013 - TCU – Plenário. Valores entre 1º e 3° quartis."]
["(9) Valores definidos a partir dos limites definidos no Acórdão nº 2.622/2013 - TCU – Plenário. Valores adotados e praticados no mercado ( “ ex ante ” ) ou aqueles entre os 1º e 3º quartis."]
[]
["(*) A fórmula para estipulação da taxa de BDI estimado adotado é a mesma que foi aplicada para a obtenção das tabelas contidas no Acórdão n. 2.622/2013 – TCUPlenário"]
[]
["Obs.: Para obras com valores superiores a R$ 20.000.000,00 sugere-se recalcular o BDI, dimensionando as taxas de administração central e lucro para patamares inferiores ao estipulado acima."]

{"sheet":"Relatório CENTRAL","index":5,"n_rows":40,"n_cols":5,"rows_kept":40,"cut":false,"hidden":false,"merged":[[7,1,7,4],[8,1,8,2],[8,3,8,4],[9,1,9,2],[10,1,10,4],[11,1,11,4],[39,1,39,2],[9,0,11,0],[0,1,0,4],[6,3,6,4],[9,3,9,4],[1,1,1,4],[2,1,2,2],[2,3,2,4],[3,1,3,2],[3,3,3,4],[4,1,4,4],[5,1,5,2],[5,3,5,4],[6,1,6,2]]}
[]
[]
[null,"UNIDADE ESCOLAR",null,"CIDADE"]
[null,{"$f":"Orçamento!$O$4","v":"COLÉGIO ESTADUAL ELVIRA LEÃO BARRETO"},null,{"$f":"Orçamento!$V$7","v":"SIMOLÂNDIA"}]
[]
[null,"OBRA",null,"CRE"]
[null,{"$f":"Orçamento!$O$7","v":"REFORMA"},null,{"$f":"Orçamento!$O$10","v":"POSSE"}]
[]
[null,"ENDEREÇO",null,"DATA"]
["FILTRO",{"$f":"Orçamento!$R$10","v":"R HUMBERTO ALENCAR CASTELO BRANCO S/N, CENTRO, CEP:73930-000"},null,{"$f":"Orçamento!$S$7","v":"2020-05-12"}]
[]
[null,"RELATÓRIO CENTRAL"]
["↓","CÓDIGO","ETAPA","PREÇO  (R$) C/ BDI","PARTIC  ( % )"]
[{"$f":"IF(D14>0,\"F\",\"\")","v":""},{"$f":"Orçamento!O594","v":"a."},{"$f":"Orçamento!P594","v":"SERVIÇOS PRELIMINARES"},{"$f":"Orçamento!V594","v":0},{"$f":"Orçamento!X594","v":0}]
[{"$f":"IF(D15>0,\"F\",\"\")","v":""},{"$f":"Orçamento!O595","v":"b."},{"$f":"Orçamento!P595","v":"TRANSPORTES"},{"$f":"Orçamento!V595","v":0},{"$f":"Orçamento!X595","v":0}]
["",{"$f":"Orçamento!O596","v":"c."},{"$f":"Orçamento!P596","v":"SERVIÇO EM TERRA"},{"$f":"Orçamento!V596","v":0},{"$f":"Orçamento!X596","v":0}]
["",{"$f":"Orçamento!O597","v":"d."},{"$f":"Orçamento!P597","v":"FUNDAÇÕES E SONDAGENS"},{"$f":"Orçamento!V597","v":0},{"$f":"Orçamento!X597","v":0}]
["",{"$f":"Orçamento!O598","v":"e."},{"$f":"Orçamento!P598","v":"ESTRUTURA"},{"$f":"Orçamento!V598","v":0},{"$f":"Orçamento!X598","v":0}]
["",{"$f":"Orçamento!O599","v":"f."},{"$f":"Orçamento!P599","v":"INSTALAÇÕES ELÉTRICAS"},{"$f":"Orçamento!V599","v":0},{"$f":"Orçamento!X599","v":0}]
["",{"$f":"Orçamento!O600","v":"g."},{"$f":"Orçamento!P600","v":"INSTALAÇÕES HIDROSSANITÁRIAS"},{"$f":"Orçamento!V600","v":0},{"$f":"Orçamento!X600","v":0}]
["",{"$f":"Orçamento!O601","v":"h"},{"$f":"Orçamento!P601","v":"INSTALAÇÕES ESPECIAIS"},{"$f":"Orçamento!V601","v":0},{"$f":"Orçamento!X601","v":0}]
["",{"$f":"Orçamento!O602","v":"i."},{"$f":"Orçamento!P602","v":"ALVENARIAS E DIVISÓRIAS"},{"$f":"Orçamento!V602","v":0},{"$f":"Orçamento!X602","v":0}]
["",{"$f":"Orçamento!O603","v":"j."},{"$f":"Orçamento!P603","v":"ALVENARIA AUTO-PORTANTE"},{"$f":"Orçamento!V603","v":0},{"$f":"Orçamento!X603","v":0}]
["",{"$f":"Orçamento!O604","v":"k."},{"$f":"Orçamento!P604","v":"IMPERMEABILIZAÇÃO"},{"$f":"Orçamento!V604","v":0},{"$f":"Orçamento!X604","v":0}]
["",{"$f":"Orçamento!O605","v":"l."},{"$f":"Orçamento!P605","v":"ISOLAMENTO TÉRMICO E ACÚSTICO"},{"$f":"Orçamento!V605","v":0},{"$f":"Orçamento!X605","v":0}]
["",{"$f":"Orçamento!O606","v":"m."},{"$f":"Orçamento!P606","v":"ESTRUTURA DE MADEIRA"},{"$f":"Orçamento!V606","v":0},{"$f":"Orçamento!X606","v":0}]
["",{"$f":"Orçamento!O607","v":"n."},{"$f":"Orçamento!P607","v":"ESTRUTURAS METÁLICAS"},{"$f":"Orçamento!V607","v":0},{"$f":"Orçamento!X607","v":0}]
["",{"$f":"Orçamento!O608","v":"o."},{"$f":"Orçamento!P608","v":"COBERTURAS"},{"$f":"Orçamento!V608","v":0},{"$f":"Orçamento!X608","v":0}]
["",{"$f":"Orçamento!O609","v":"p."},{"$f":"Orçamento!P609","v":"ESQUADRIAS DE MADEIRA"},{"$f":"Orçamento!V609","v":0},{"$f":"Orçamento!X609","v":0}]
["",{"$f":"Orçamento!O610","v":"q."},{"$f":"Orçamento!P610","v":"ESQUADRIAS METÁLICAS"},{"$f":"Orçamento!V610","v":0},{"$f":"Orçamento!X610","v":0}]
["",{"$f":"Orçamento!O611","v":"r."},{"$f":"Orçamento!P611","v":"VIDROS"},{"$f":"Orçamento!V611","v":0},{"$f":"Orçamento!X611","v":0}]
["",{"$f":"Orçamento!O612","v":"s."},{"$f":"Orçamento!P612","v":"REVESTIMENTO DE PAREDE"},{"$f":"Orçamento!V612","v":0},{"$f":"Orçamento!X612","v":0}]
["",{"$f":"Orçamento!O613","v":"t."},{"$f":"Orçamento!P613","v":"FORROS"},{"$f":"Orçamento!V613","v":0},{"$f":"Orçamento!X613","v":0}]
["",{"$f":"Orçamento!O614","v":"u."},{"$f":"Orçamento!P614","v":"REVESTIMENTO DE PISO"},{"$f":"Orçamento!V614","v":0},{"$f":"Orçamento!X614","v":0}]
["",{"$f":"Orçamento!O615","v":"v."},{"$f":"Orçamento!P615","v":"FERRAGENS"},{"$f":"Orçamento!V615","v":0},{"$f":"Orçamento!X615","v":0}]
["",{"$f":"Orçamento!O616","v":"w."},{"$f":"Orçamento!P616","v":"MARCENARIA"},{"$f":"Orçamento!V616","v":0},{"$f":"Orçamento!X616","v":0}]
["",{"$f":"Orçamento!O617","v":"x."},{"$f":"Orçamento!P617","v":"ADMINISTRAÇÃO"},{"$f":"Orçamento!V617","v":0},{"$f":"Orçamento!X617","v":0}]
["",{"$f":"Orçamento!O618","v":"y."},{"$f":"Orçamento!P618","v":"PINTURA"},{"$f":"Orçamento!V618","v":0},{"$f":"Orçamento!X618","v":0}]
["",{"$f":"Orçamento!O619","v":"z."},{"$f":"Orçamento!P619","v":"DIVERSOS"},{"$f":"Orçamento!V619","v":0},{"$f":"Orçamento!X619","v":0}]
["F","TOTAL GERAL DO ORÇAMENTO (R$) C/BDI",null,{"$f":"SUM(D14:D39)","v":0},{"$f":"SUM(E14:E39)","v":0}]

{"sheet":"Parc Maior Relev","index":6,"n_rows":21,"n_cols":7,"rows_kept":21,"cut":false,"hidden":false,"merged":[[10,0,12,0],[8,1,8,3],[8,4,8,6],[21,3,21,7],[19,1,19,6],[0,1,0,6],[11,1,11,6],[1,1,1,6],[2,1,2,3],[2,4,2,6],[3,1,3,3],[3,4,3,6],[4,1,4,6],[5,1,5,3],[5,4,5,6],[9,1,9,3],[9,4,9,6],[10,1,10,6],[6,1,6,3],[6,4,6,6],[7,1,7,6]]}
[]
[]
[null,"UNIDADE ESCOLAR",null,null,"CÓDIGO INEP"]
[null,{"$f":"Orçamento!$O$4","v":"COLÉGIO ESTADUAL ELVIRA LEÃO BARRETO"},null,null,{"$f":"Orçamento!$V$4","v":52042910}]
[]
[null,"OBRA",null,null,"CIDADE"]
[null,{"$f":"Orçamento!$O$7","v":"REFORMA"},null,null,{"$f":"Orçamento!$V$7","v":"SIMOLÂNDIA"}]
[]
[null,"CRE",null,null,"ÁREA TOTAL CONSTRUÍDA (M²)"]
[null,{"$f":"Orçamento!$O$10","v":"POSSE"},null,null,{"$f":"Orçamento!$S$13","v":1267.68}]
["FILTRO"]
[null,"PARCELA DE MAIOR RELEVÂNCIA"]
[null,"CÓDIGO","SERVIÇO","DESCRIÇÃO","UNID","QUANT","PARC. MAIOR RELEV (50%)"]
[{"$f":"IF(F14>0,\"F\",\"\")","v":"F"},{"$f":"Somatório!B37","v":"u."},{"$f":"IFERROR(VLOOKUP(B14,Orçamento!$O$594:$P$619,2,FALSE),\"(inserir código ao lado)\")","v":"REVESTIMENTO DE PISO"},"GRANITINA","M2",{"$f":"68.6+59.98","v":128.57999999999998},{"$f":"F14*0.5","v":64.289999999999992}]
[{"$f":"IF(F15>0,\"F\",\"\")","v":"F"},{"$f":"Somatório!B31","v":"o."},{"$f":"IFERROR(VLOOKUP(B15,Orçamento!$O$594:$P$619,2,FALSE),\"(inserir código ao lado)\")","v":"COBERTURAS"},"TELHA CERAMICA","M2",{"$f":"400+71.37+88.69","v":560.05999999999995},280.02999999999997]
[{"$f":"IF(F16>0,\"F\",\"\")","v":"F"},{"$f":"Somatório!B36","v":"t."},{"$f":"IFERROR(VLOOKUP(B16,Orçamento!$O$594:$P$619,2,FALSE),\"(inserir código ao lado)\")","v":"FORROS"},"FORRO PVC","M2",296,{"$f":"F16*0.5","v":148}]
["",null,{"$f":"IFERROR(VLOOKUP(B17,Orçamento!$O$594:$P$619,2,FALSE),\"(inserir código ao lado)\")","v":"(inserir código ao lado)"},null,{"$f":"IFERROR(VLOOKUP($D17,Orçamento!$R$20:$W$575,2,FALSE),\"-\")","v":"-"},{"$f":"SUMIF(Orçamento!$R$20:$R$575,'Parc Maior Relev'!D17,Orçamento!$T$20:$T$575)","v":0},0]
["",null,{"$f":"IFERROR(VLOOKUP(B18,Orçamento!$O$594:$P$619,2,FALSE),\"(inserir código ao lado)\")","v":"(inserir código ao lado)"},null,{"$f":"IFERROR(VLOOKUP($D18,Orçamento!$R$20:$W$575,2,FALSE),\"-\")","v":"-"},{"$f":"SUMIF(Orçamento!$R$20:$R$575,'Parc Maior Relev'!D18,Orçamento!$T$20:$T$575)","v":0},0]
["F"]
["F","(*) Para os fins do inciso I dp § 1º do Art. 30 da Lei Federal 8.666/93, são consideradas parcelas de maior relevância técnica as execuções apresentadas"]
["F"]

{"sheet":"Composições","index":7,"n_rows":219,"n_cols":10,"rows_kept":219,"cut":false,"hidden":false,"merged":[[0,0,0,8],[10,0,10,2],[10,3,10,6],[11,0,11,9],[12,0,12,2],[12,3,12,6],[12,7,12,8],[7,0,7,6],[9,0,9,2],[9,3,9,6],[9,7,9,8],[3,0,3,6],[4,0,4,6],[15,0,15,9],[13,0,13,2],[13,3,13,6],[1,0,1,9],[3,7,3,9],[4,7,4,9],[6,7,6,9],[7,7,7,9],[6,0,6,6],[10,8,10,9],[13,8,13,9],[14,0,14,9],[8,0,8,9],[5,0,5,9],[2,0,2,9],[16,5,17,5],[16,6,16,7],[16,8,16,9],[22,1,22,7],[26,1,26,7],[16,0,17,0],[16,1,17,1],[16,2,17,2],[16,3,17,3],[16,4,17,4],[28,5,29,5],[28,6,28,7],[28,8,28,9],[34,1,34,7],[38,1,38,7],[28,0,29,0],[28,1,29,1],[28,2,29,2],[28,3,29,3],[28,4,29,4],[40,5,41,5],[40,6,40,7],[40,8,40,9],[44,1,44,7],[48,1,48,7],[40,0,41,0],[40,1,41,1],[40,2,41,2],[40,3,41,3],[40,4,41,4],[50,5,51,5],[50,6,50,7],[50,8,50,9],[56,1,56,7],[63,1,63,7],[50,0,51,0],[50,1,51,1],[50,2,51,2],[50,3,51,3],[50,4,51,4],[65,5,66,5],[65,6,65,7],[65,8,65,9],[72,1,72,7],[86,1,86,7],[65,0,66,0],[65,1,66,1],[65,2,66,2],[65,3,66,3],[65,4,66,4],[88,5,89,5],[88,6,88,7],[88,8,88,9],[94,1,94,7],[98,1,98,7],[88,0,89,0],[88,1,89,1],[88,2,89,2],[88,3,89,3],[88,4,89,4],[100,5,101,5],[100,6,100,7],[100,8,100,9],[106,1,106,7],[110,1,110,7],[100,0,101,0],[100,1,101,1],[100,2,101,2],[100,3,101,3],[100,4,101,4],[112,5,113,5],[112,6,112,7],[112,8,112,9],[118,1,118,7],[122,1,122,7],[112,0,113,0],[112,1,113,1],[112,2,113,2],[112,3,113,3],[112,4,113,4],[124,5,125,5],[124,6,124,7],[124,8,124,9],[130,1,130,7],[134,1,134,7],[124,0,125,0],[124,1,125,1],[124,2,125,2],[124,3,125,3],[124,4,125,4],[136,5,137,5],[136,6,136,7],[136,8,136,9],[142,1,142,7],[146,1,146,7],[136,0,137,0],[136,1,137,1],[136,2,137,2],[136,3,137,3],[136,4,137,4],[148,5,149,5],[148,6,148,7],[148,8,148,9],[154,1,154,7],[158,1,158,7],[148,0,149,0],[148,1,149,1],[148,2,149,2],[148,3,149,3],[148,4,149,4],[160,5,161,5],[160,6,160,7],[160,8,160,9],[166,1,166,7],[170,1,170,7],[160,0,161,0],[160,1,161,1],[160,2,161,2],[160,3,161,3],[160,4,161,4],[172,5,173,5],[172,6,172,7],[172,8,172,9],[178,1,178,7],[182,1,182,7],[172,0,173,0],[172,1,173,1],[172,2,173,2],[172,3,173,3],[172,4,173,4],[184,5,185,5],[184,6,184,7],[184,8,184,9],[190,1,190,7],[194,1,194,7],[184,0,185,0],[184,1,185,1],[184,2,185,2],[184,3,185,3],[184,4,185,4],[196,5,197,5],[196,6,196,7],[196,8,196,9],[202,1,202,7],[206,1,206,7],[196,0,197,0],[196,1,197,1],[196,2,197,2],[196,3,197,3],[196,4,197,4],[208,5,209,5],[208,6,208,7],[208,8,208,9],[214,1,214,7],[218,1,218,7],[208,0,209,0],[208,1,209,1],[208,2,209,2],[208,3,209,3],[208,4,209,4]]}
[]
[]
[]
["UNIDADE ESCOLAR",null,null,null,null,null,null,"CÓDIGO INEP"]
[{"$f":"Orçamento!$O$4","v":"COLÉGIO ESTADUAL ELVIRA LEÃO BARRETO"},null,null,null,null,null,null,{"$f":"Orçamento!$V$4","v":52042910}]
[]
["OBRA",null,null,null,null,null,null,"CIDADE"]
[{"$f":"Orçamento!$O$7","v":"REFORMA"},null,null,null,null,null,null,{"$f":"Orçamento!$V$7","v":"SIMOLÂNDIA"}]
[]
["CRE",null,null,"ENDEREÇO",null,null,null,"REFERÊNCIA AGETOP"]
[{"$f":"Orçamento!$O$10","v":"POSSE"},null,null,{"$f":"Orçamento!$R$10","v":"R HUMBERTO ALENCAR CASTELO BRANCO S/N, CENTRO, CEP:73930-000"},null,null,null,{"$f":"Orçamento!$V$10","v":"DEZ/18"},{"$f":"Orçamento!$W$10","v":"DESONERADA"}]
[]
["DATA",null,null,"ÁREA TOTAL CONSTRUÍDA (M²)",null,null,null,"REFERÊNCIA SINAPI"]
[{"$f":"Orçamento!$S$7","v":"2020-05-12"},null,null,{"$f":"Orçamento!$S$13","v":1267.68},null,null,null,{"$f":"Orçamento!$V$13","v":"MAR/19"},{"$f":"Orçamento!$W$13","v":"DESONERADA"}]
[]
["COMPOSIÇÕES DE CUSTOS UNITÁRIOS - SEE-GO"]
[387,"FONTE","CÓDIGO","DESCRIÇÃO","UNIDADE","COEFIC.","CUSTO UNITÁRIO",null,"CUSTO  TOTAL (A) + (B) + (C) + (D) + (E)"]
[null,null,null,null,null,null,"DESONERADO","NÃO DESONER.","DESONERADO","NÃO DESONER."]
[null,"COMPOSIÇÃO","COMP 387_SEE","LÂMPADA LED TUBULAR 18W ","UN ",null,null,null,22.28,22.330000000000002]
[null,"AGETOP_I",8,"AJUDANTE","h     ",1.4999999999999999E-2,8.1999999999999993,9.51,0.12,0.14000000000000001]
[null,"AGETOP_I",12,"ELETRICISTA","h     ",1.4999999999999999E-2,13.4,15.53,0.2,0.23]
[null,null,null,"","",null,0,0,0,0]
[null,"MÃO DE OBRA (B) - TOTAL",null,null,null,null,null,null,0.32,0.37]
[null,"COTAÇÃO","COT 195_SEE","LÂMPADA LED TUBULAR 18W ","UN",1,21.959999999999997,21.959999999999997,21.96,21.96]
[null,null,null,"","",null,0,0,0,0]
[null,null,null,"","",null,0,0,0,0]
[null,"MATERIAL (C) - TOTAL",null,null,null,null,null,null,21.96,21.96]
[]
[24,"FONTE","CÓDIGO","DESCRIÇÃO","UNIDADE","COEFIC.","CUSTO UNITÁRIO",null,"CUSTO  TOTAL (A) + (B) + (C) + (D) + (E)"]
[null,null,null,null,null,null,"DESONERADO","NÃO DESONER.","DESONERADO","NÃO DESONER."]
[null,"COMPOSIÇÃO","COMP 024_SEE","SINALIZADOR FOTOLUMINESCENTE PARA EXTINTOR","UN ",null,"-","-",25.269999999999996,25.389999999999997]
[null,"AGETOP_I",5,"SERVENTE","h     ",0.09,8.1999999999999993,9.51,0.74,0.86]
[null,null,null,"","",null,0,0,0,0]
[null,null,null,"","",null,0,0,0,0]
[null,"MÃO DE OBRA (B) - TOTAL",null,null,null,null,null,null,0.74,0.86]
[null,"AGETOP_I",3070,"BUCHA DE NYLON S-6","un",2,0.04,0.04,0.08,0.08]
[null,"AGETOP_I",3393,"PARAFUSO P/BUCHA S-6","un",2,0.08,0.08,0.16,0.16]
[null,"SINAPI_I",37556,"PLACA DE SINALIZACAO DE SEGURANCA CONTRA INCENDIO, FOTOLUMINESCENTE, QUADRADA, *20 X 20* CM, EM PVC *2* MM ANTI-CHAMAS (SIMBOLOS, CORES E PICTOGRAMAS CONFORME NBR 13434)","UN    ",1,24.29,24.29,24.29,24.29]
[null,"MATERIAL (C) - TOTAL",null,null,null,null,null,null,24.529999999999998,24.529999999999998]
[]
[25,"FONTE","CÓDIGO","DESCRIÇÃO","UNIDADE","COEFIC.","CUSTO UNITÁRIO",null,"CUSTO  TOTAL (A) + (B) + (C) + (D) + (E)"]
[null,null,null,null,null,null,"DESONERADO","NÃO DESONER.","DESONERADO","NÃO DESONER."]
[null,"COMPOSIÇÃO","COMP 025_SEE","SINALIZADOR FOTOLUMINESCENTE DE EMERGÊNCIA","UN ",null,"-","-",25.269999999999996,25.389999999999997]
[null,"AGETOP_I",5,"SERVENTE","h     ",0.09,8.1999999999999993,9.51,0.74,0.86]
[null,"MÃO DE OBRA (B) - TOTAL",null,null,null,null,null,null,0.74,0.86]
[null,"AGETOP_I",3070,"BUCHA DE NYLON S-6","un",2,0.04,0.04,0.08,0.08]
[null,"AGETOP_I",3393,"PARAFUSO P/BUCHA S-6","un",2,0.08,0.08,0.16,0.16]
[null,"SINAPI_I",37556,"PLACA DE SINALIZACAO DE SEGURANCA CONTRA INCENDIO, FOTOLUMINESCENTE, QUADRADA, *20 X 20* CM, EM PVC *2* MM ANTI-CHAMAS (SIMBOLOS, CORES E PICTOGRAMAS CONFORME NBR 13434)","UN    ",1,24.29,24.29,24.29,24.29]
[null,"MATERIAL (C) - TOTAL",null,null,null,null,null,null,24.529999999999998,24.529999999999998]
[]
[277,"FONTE","CÓDIGO","DESCRIÇÃO","UNIDADE","COEFIC.","CUSTO UNITÁRIO",null,"CUSTO  TOTAL (A) + (B) + (C) + (D) + (E)"]
[null,null,null,null,null,null,"DESONERADO","NÃO DESONER.","DESONERADO","NÃO DESONER."]
[null,"COMPOSIÇÃO","COMP 277_SEE","MARCAÇÃO NO PISO - 1X1 M PARA EXTINTOR","M2",null,null,null,27.719999999999995,27.799999999999997]
[null,"AGETOP_I",5,"SERVENTE","h     ",3.3300000000000003E-2,8.1999999999999993,9.51,0.27,0.32]
[null,null,null,"","",null,0,0,0,0]
[null,null,null,"","",null,0,0,0,0]
[null,"MÃO DE OBRA (B) - TOTAL",null,null,null,null,null,null,0.27,0.32]
[null,"SINAPI_I",5318,"SOLVENTE DILUENTE A BASE DE AGUARRAS","L     ",0.13,10.98,10.98,1.43,1.43]
[null,"SINAPI",5824,"CAMINHÃO TOCO, PBT 16.000 KG, CARGA ÚTIL MÁX. 10.685 KG, DIST. ENTRE EIXOS 4,8 M, POTÊNCIA 189 CV, INCLUSIVE CARROCERIA FIXA ABERTA DE MADEIRA P/ TRANSPORTE GERAL DE CARGA SECA, DIMEN. APROX. 2,5 X 7,00 X 0,50 M - CHP DIURNO. AF_06/2014","CHP",3.3E-3,135.91999999999999,139.13,0.45,0.46]
[null,"SINAPI_I",7343,"TINTA A BASE DE RESINA ACRILICA, PARA SINALIZACAO HORIZONTAL VIARIA (NBR 11862)","L     ",0.6,11.69,11.69,7.01,7.01]
[null,"SINAPI_I",7348,"TINTA ACRILICA PREMIUM PARA PISO","L     ",0.03,12.39,12.39,0.37,0.37]
[null,"SINAPI_I",25972,"MICROESFERAS DE VIDRO PARA SINALIZACAO HORIZONTAL VIARIA, TIPO I-B (PREMIX) - NBR 16184","KG    ",2.14,8.33,8.33,17.829999999999998,17.829999999999998]
[null,"SINAPI",95133,"MÁQUINA DEMARCADORA DE FAIXA DE TRÁFEGO À FRIO, AUTOPROPELIDA, POTÊNCIA 38 HP - CHP DIURNO. AF_07/2016","CHP",3.3E-3,110.07,113.65,0.36,0.38]
[null,"MATERIAL (C) - TOTAL",null,null,null,null,null,null,27.449999999999996,27.479999999999997]
[]
[402,"FONTE","CÓDIGO","DESCRIÇÃO","UNIDADE","COEFIC.","CUSTO UNITÁRIO",null,"CUSTO  TOTAL (A) + (B) + (C) + (D) + (E)"]
[null,null,null,null,null,null,"DESONERADO","NÃO DESONER.","DESONERADO","NÃO DESONER."]
[null,"COMPOSIÇÃO","COMP 402_SEE","QD.GIZ EMBOCO/LAM.MELAMINICO COMPL.-ESC.2000 4,50X1,40M","M2",null,null,null,807.77,863.83999999999992]
[null,"AGETOP_I",5,"SERVENTE","h     ",14.423439414407337,8.1999999999999993,9.51,118.27,137.16999999999999]
[null,"AGETOP_I",18,"PINTOR","h     ",0.27853978825673081,13.4,15.53,3.73,4.33]
[null,"AGETOP_I",4,"PEDREIRO","h     ",4.8722031981401779,13.4,15.53,65.290000000000006,75.67]
[null,"AGETOP_I",24,"MARCENEIRO","h     ",12.299029248217144,13.4,15.53,164.81,191]
[null,"MÃO DE OBRA (B) - TOTAL",null,null,null,null,null,null,352.1,408.17]
[null,"AGETOP_I",2062,"TINTA PARA QUADRO DE GIZ","l",1.0748389934340736,25.83,25.83,27.76,27.76]
[null,"AGETOP_I",2237,"VERNIZ ACRILICO","l",0.40850742986396904,13.61,13.61,5.56,5.56]
[null,"AGETOP_I",1215,"CIMENTO PORTLAND C.P. 32","Kg",62.590502968803989,0.39,0.39,24.41,24.41]
[null,"AGETOP_I",1243,"COLA FORMICA ( 1L = 0,83KG)","l",2.9511231189720712,17.86,17.86,52.71,52.71]
[null,"AGETOP_I",104,"AREIA MEDIA ","m3",0.19343407370173729,82.85,82.85,16.03,16.03]
[null,"AGETOP_I",1111,"AGUARRÁS MINERAL OU EQUIVALENTE","l",6.1289309164022483E-2,8.65,8.65,0.53,0.53]
[null,"AGETOP_I",1674,"LIXA PARA PAREDE ( NÚMERO 100 )","un",2.5423517954195591,0.75,0.75,1.91,1.91]
[null,"AGETOP_I",2351,"FORMICA VERDE ESC.   3,08X1,25","m2",2.2364990103986679,62.34,62.34,139.41999999999999,139.41999999999999]
[null,"AGETOP_I",1970,"SOLVENTE","l",0.26310200747698781,8.5,8.5,2.2400000000000002,2.2400000000000002]
[null,"AGETOP_I",2294,"SELADOR ACRILICO","l",0.49875907134554359,6.57,6.57,3.28,3.28]
[null,"AGETOP_I",1704,"MADEIRA DE LEI PARA TELHADO (ANGELIM VERMELHO)","m3",6.7160943734095688E-2,2142.86,2142.86,143.91999999999999,143.91999999999999]
[null,"AGETOP_I",1708,"MASSA A OLEO","Kg",2.0781627972730981,14.62,14.62,30.38,30.38]
[null,"AGETOP_I",2221,"PARAFUSO COM BUCHA S-8","un",37.604850617322732,0.2,0.2,7.52,7.52]
[null,"MATERIAL (C) - TOTAL",null,null,null,null,null,null,455.66999999999996,455.66999999999996]
[]
[382,"FONTE","CÓDIGO","DESCRIÇÃO","UNIDADE","COEFIC.","CUSTO UNITÁRIO",null,"CUSTO  TOTAL (A) + (B) + (C) + (D) + (E)"]
[null,null,null,null,null,null,"DESONERADO","NÃO DESONER.","DESONERADO","NÃO DESONER."]
[null,"COMPOSIÇÃO","COMP 382_SEE","TE DE REDUCAO DE FERRO GALVANIZADO, COM ROSCA BSP, DE 3/4\" X 1/2\"","UN ",null,null,null,21.83,23.92]
[null,"AGETOP_I",8,"AJUDANTE","h     ",0.6,8.1999999999999993,9.51,4.92,5.71]
[null,"AGETOP_I",11,"ENCANADOR","h     ",0.61050000000000004,13.4,15.53,8.18,9.48]
[null,null,null,"","",null,0,0,0,0]
[null,"MÃO DE OBRA (B) - TOTAL",null,null,null,null,null,null,13.1,15.190000000000001]
[null,"SINAPI_I",3146,"FITA VEDA ROSCA EM ROLOS DE 18 MM X 10 M (L X C)","UN    ",0.12075471698113208,3.5,3.5,0.42,0.42]
[null,"SINAPI_I",6302,"TE DE REDUCAO DE FERRO GALVANIZADO, COM ROSCA BSP, DE 3/4\" X 1/2\"","UN    ",1,8.31,8.31,8.31,8.31]
[null,null,null,"","",null,0,0,0,0]
[null,"MATERIAL (C) - TOTAL",null,null,null,null,null,null,8.73,8.73]
[]
[383,"FONTE","CÓDIGO","DESCRIÇÃO","UNIDADE","COEFIC.","CUSTO UNITÁRIO",null,"CUSTO  TOTAL (A) + (B) + (C) + (D) + (E)"]
[null,null,null,null,null,null,"DESONERADO","NÃO DESONER.","DESONERADO","NÃO DESONER."]
[null,"COMPOSIÇÃO","COMP 383_SEE","BUCHA DE REDUCAO DE FERRO GALVANIZADO, COM ROSCA BSP, DE 1/2\" X 1/4\"","UN ",null,null,null,6.85,7.4]
[null,"AGETOP_I",8,"AJUDANTE","h     ",0.16,8.1999999999999993,9.51,1.31,1.52]
[null,"AGETOP_I",11,"ENCANADOR","h     ",0.16,13.4,15.53,2.14,2.48]
[null,null,null,"","",null,0,0,0,0]
[null,"MÃO DE OBRA (B) - TOTAL",null,null,null,null,null,null,3.45,4]
[null,"AGETOP_I","H689","FITA VEDAROSCA 12 MM","m",1.2,0.28000000000000003,0.28000000000000003,0.34,0.34]
[null,"SINAPI_I",770,"BUCHA DE REDUCAO DE FERRO GALVANIZADO, COM ROSCA BSP, DE 1/2\" X 1/4\"","UN    ",1,3.06,3.06,3.06,3.06]
[null,null,null,"","",null,0,0,0,0]
[null,"MATERIAL (C) - TOTAL",null,null,null,null,null,null,3.4,3.4]
[]
[212,"FONTE","CÓDIGO","DESCRIÇÃO","UNIDADE","COEFIC.","CUSTO UNITÁRIO",null,"CUSTO  TOTAL (A) + (B) + (C) + (D) + (E)"]
[null,null,null,null,null,null,"DESONERADO","NÃO DESONER.","DESONERADO","NÃO DESONER."]
[null,"COMPOSIÇÃO","COMP 212_SEE","NIPLE DE REDUÇÃO 1/2\" X 1/4\" BSP","UN ",null,null,null,9.5,10.050000000000001]
[null,"AGETOP_I",8,"AJUDANTE","h     ",0.16,8.1999999999999993,9.51,1.31,1.52]
[null,"AGETOP_I",11,"ENCANADOR","h     ",0.16,13.4,15.53,2.14,2.48]
[null,null,null,"","",null,0,0,0,0]
[null,"MÃO DE OBRA (B) - TOTAL",null,null,null,null,null,null,3.45,4]
[null,"COTAÇÃO","COT 103_SEE","NIPLE DE REDUÇÃO 1/2\" X 1/4\" BSP","UN",1,6.0533333333333337,6.0533333333333337,6.05,6.05]
[null,null,null,"","",null,0,0,0,0]
[null,null,null,"","",null,0,0,0,0]
[null,"MATERIAL (C) - TOTAL",null,null,null,null,null,null,6.05,6.05]
[]
[213,"FONTE","CÓDIGO","DESCRIÇÃO","UNIDADE","COEFIC.","CUSTO UNITÁRIO",null,"CUSTO  TOTAL (A) + (B) + (C) + (D) + (E)"]
[null,null,null,null,null,null,"DESONERADO","NÃO DESONER.","DESONERADO","NÃO DESONER."]
[null,"COMPOSIÇÃO","COMP 213_SEE","NIPLE DE REDUÇÃO 3/4\" X 1/2\" BSP","UN ",null,null,null,13.16,13.71]
[null,"AGETOP_I",8,"AJUDANTE","h     ",0.16,8.1999999999999993,9.51,1.31,1.52]
[null,"AGETOP_I",11,"ENCANADOR","h     ",0.16,13.4,15.53,2.14,2.48]
[null,null,null,"","",null,0,0,0,0]
[null,"MÃO DE OBRA (B) - TOTAL",null,null,null,null,null,null,3.45,4]
[null,"COTAÇÃO","COT 104_SEE","NIPLE DE REDUÇÃO 3/4\" X 1/2\" BSP","UN",1,9.7099999999999991,9.7099999999999991,9.7100000000000009,9.7100000000000009]
[null,null,null,"","",null,0,0,0,0]
[null,null,null,"","",null,0,0,0,0]
[null,"MATERIAL (C) - TOTAL",null,null,null,null,null,null,9.7100000000000009,9.7100000000000009]
[]
[237,"FONTE","CÓDIGO","DESCRIÇÃO","UNIDADE","COEFIC.","CUSTO UNITÁRIO",null,"CUSTO  TOTAL (A) + (B) + (C) + (D) + (E)"]
[null,null,null,null,null,null,"DESONERADO","NÃO DESONER.","DESONERADO","NÃO DESONER."]
[null,"COMPOSIÇÃO","COMP 237_SEE","FITA ANTICORROSIVA","M",null,null,null,11.14,11.83]
[null,"AGETOP_I",8,"AJUDANTE","h     ",0.2,8.1999999999999993,9.51,1.64,1.9]
[null,"AGETOP_I",12,"ELETRICISTA","h     ",0.2,13.4,15.53,2.68,3.11]
[null,null,null,"","",null,0,0,0,0]
[null,"MÃO DE OBRA (B) - TOTAL",null,null,null,null,null,null,4.32,5.01]
[null,"SINAPI_I",39634,"FITA ADESIVA ANTICORROSIVA DE PVC FLEXIVEL, COR PRETA, PARA PROTECAO TUBULACAO, 50 MM X 30 M (L X C), E= *0,25* MM","M     ",1,6.82,6.82,6.82,6.82]
[null,null,null,"","",null,0,0,0,0]
[null,null,null,"","",null,0,0,0,0]
[null,"MATERIAL (C) - TOTAL",null,null,null,null,null,null,6.82,6.82]
[]
[542,"FONTE","CÓDIGO","DESCRIÇÃO","UNIDADE","COEFIC.","CUSTO UNITÁRIO",null,"CUSTO  TOTAL (A) + (B) + (C) + (D) + (E)"]
[null,null,null,null,null,null,"DESONERADO","NÃO DESONER.","DESONERADO","NÃO DESONER."]
[null,"COMPOSIÇÃO","COMP 542_SEE","VÁLVULA UGV 3/4\" (S) LATÃO","UN ",null,null,null,25.17,26.66]
[null,"AGETOP_I",8,"AJUDANTE","h     ",0.432,8.1999999999999993,9.51,3.54,4.1100000000000003]
[null,"AGETOP_I",11,"ENCANADOR","h     ",0.432,13.4,15.53,5.79,6.71]
[null,null,null,"","",null,0,0,0,0]
[null,"MÃO DE OBRA (B) - TOTAL",null,null,null,null,null,null,9.33,10.82]
[null,"COTAÇÃO","COT 281_SEE","VÁLVULA UGV 3/4\" (S) LATÃO","UN ",1,15.836666666666666,15.836666666666666,15.84,15.84]
[null,null,null,"","",null,0,0,0,0]
[null,null,null,"","",null,0,0,0,0]
[null,"MATERIAL (C) - TOTAL",null,null,null,null,null,null,15.84,15.84]
[]
[543,"FONTE","CÓDIGO","DESCRIÇÃO","UNIDADE","COEFIC.","CUSTO UNITÁRIO",null,"CUSTO  TOTAL (A) + (B) + (C) + (D) + (E)"]
[null,null,null,null,null,null,"DESONERADO","NÃO DESONER.","DESONERADO","NÃO DESONER."]
[null,"COMPOSIÇÃO","COMP 543_SEE","VÁLVULA UGV 1/2\" (S) LATÃO","UN ",null,null,null,24.5,25.990000000000002]
[null,"AGETOP_I",8,"AJUDANTE","h     ",0.432,8.1999999999999993,9.51,3.54,4.1100000000000003]
[null,"AGETOP_I",11,"ENCANADOR","h     ",0.432,13.4,15.53,5.79,6.71]
[null,null,null,"","",null,0,0,0,0]
[null,"MÃO DE OBRA (B) - TOTAL",null,null,null,null,null,null,9.33,10.82]
[null,"COTAÇÃO","COT 282_SEE","VÁLVULA UGV 1/2\" (S) LATÃO","UN ",1,15.166666666666666,15.166666666666666,15.17,15.17]
[null,null,null,"","",null,0,0,0,0]
[null,null,null,"","",null,0,0,0,0]
[null,"MATERIAL (C) - TOTAL",null,null,null,null,null,null,15.17,15.17]
[]
[211,"FONTE","CÓDIGO","DESCRIÇÃO","UNIDADE","COEFIC.","CUSTO UNITÁRIO",null,"CUSTO  TOTAL (A) + (B) + (C) + (D) + (E)"]
[null,null,null,null,null,null,"DESONERADO","NÃO DESONER.","DESONERADO","NÃO DESONER."]
[null,"COMPOSIÇÃO","COMP 211_SEE","REGULADOR DE 2º ESTÁGIO 5KG/H","UN ",null,null,null,85.46,89.419999999999987]
[null,"AGETOP_I",8,"AJUDANTE","h     ",1.1499999999999999,8.1999999999999993,9.51,9.43,10.94]
[null,"AGETOP_I",11,"ENCANADOR","h     ",1.1499999999999999,13.4,15.53,15.41,17.86]
[null,null,null,"","",null,0,0,0,0]
[null,"MÃO DE OBRA (B) - TOTAL",null,null,null,null,null,null,24.84,28.799999999999997]
[null,"COTAÇÃO","COT 102_SEE","REGULADOR DE 2º ESTÁGIO 5KG/H","UN",1,59.833333333333336,59.833333333333336,59.83,59.83]
[null,"AGETOP_I","H689","FITA VEDAROSCA 12 MM","m",2.82,0.28000000000000003,0.28000000000000003,0.79,0.79]
[null,null,null,"","",null,0,0,0,0]
[null,"MATERIAL (C) - TOTAL",null,null,null,null,null,null,60.62,60.62]
[]
[210,"FONTE","CÓDIGO","DESCRIÇÃO","UNIDADE","COEFIC.","CUSTO UNITÁRIO",null,"CUSTO  TOTAL (A) + (B) + (C) + (D) + (E)"]
[null,null,null,null,null,null,"DESONERADO","NÃO DESONER.","DESONERADO","NÃO DESONER."]
[null,"COMPOSIÇÃO","COMP 210_SEE","REGULADOR DE 1º ESTÁGIO 60KG/H MODELO AP-40  COM MANÔMETRO","UN ",null,null,null,231.21,235.17000000000002]
[null,"AGETOP_I",8,"AJUDANTE","h     ",1.1499999999999999,8.1999999999999993,9.51,9.43,10.94]
[null,"AGETOP_I",11,"ENCANADOR","h     ",1.1499999999999999,13.4,15.53,15.41,17.86]
[null,null,null,"","",null,0,0,0,0]
[null,"MÃO DE OBRA (B) - TOTAL",null,null,null,null,null,null,24.84,28.799999999999997]
[null,"COTAÇÃO","COT 101_SEE","REGULADOR DE 1º ESTÁGIO 60KG/H MODELO AP-40  COM MANÔMETRO","UN",1,205.57666666666668,205.57666666666668,205.58,205.58]
[null,"AGETOP_I","H689","FITA VEDAROSCA 12 MM","m",2.82,0.28000000000000003,0.28000000000000003,0.79,0.79]
[null,null,null,"","",null,0,0,0,0]
[null,"MATERIAL (C) - TOTAL",null,null,null,null,null,null,206.37,206.37]
[]
[235,"FONTE","CÓDIGO","DESCRIÇÃO","UNIDADE","COEFIC.","CUSTO UNITÁRIO",null,"CUSTO  TOTAL (A) + (B) + (C) + (D) + (E)"]
[null,null,null,null,null,null,"DESONERADO","NÃO DESONER.","DESONERADO","NÃO DESONER."]
[null,"COMPOSIÇÃO","COMP 235_SEE","PLACA DE SINALIZAÇÃO EM PVC COD 01 - (300X300) PROIBIDO FUMAR","UN ",null,null,null,25.269999999999996,25.389999999999997]
[null,"AGETOP_I",5,"SERVENTE","h     ",0.09,8.1999999999999993,9.51,0.74,0.86]
[null,null,null,"","",null,0,0,0,0]
[null,null,null,"","",null,0,0,0,0]
[null,"MÃO DE OBRA (B) - TOTAL",null,null,null,null,null,null,0.74,0.86]
[null,"AGETOP_I",3070,"BUCHA DE NYLON S-6","un",2,0.04,0.04,0.08,0.08]
[null,"AGETOP_I",3393,"PARAFUSO P/BUCHA S-6","un",2,0.08,0.08,0.16,0.16]
[null,"SINAPI_I",37556,"PLACA DE SINALIZACAO DE SEGURANCA CONTRA INCENDIO, FOTOLUMINESCENTE, QUADRADA, *20 X 20* CM, EM PVC *2* MM ANTI-CHAMAS (SIMBOLOS, CORES E PICTOGRAMAS CONFORME NBR 13434)","UN    ",1,24.29,24.29,24.29,24.29]
[null,"MATERIAL (C) - TOTAL",null,null,null,null,null,null,24.529999999999998,24.529999999999998]
[]
[236,"FONTE","CÓDIGO","DESCRIÇÃO","UNIDADE","COEFIC.","CUSTO UNITÁRIO",null,"CUSTO  TOTAL (A) + (B) + (C) + (D) + (E)"]
[null,null,null,null,null,null,"DESONERADO","NÃO DESONER.","DESONERADO","NÃO DESONER."]
[null,"COMPOSIÇÃO","COMP 236_SEE","PLACA DE SINALIZAÇÃO EM PVC COD 06 - (300X300) PERIGO INFLAMÁVEL","UN ",null,null,null,25.269999999999996,25.389999999999997]
[null,"AGETOP_I",5,"SERVENTE","h     ",0.09,8.1999999999999993,9.51,0.74,0.86]
[null,null,null,"","",null,0,0,0,0]
[null,null,null,"","",null,0,0,0,0]
[null,"MÃO DE OBRA (B) - TOTAL",null,null,null,null,null,null,0.74,0.86]
[null,"AGETOP_I",3070,"BUCHA DE NYLON S-6","un",2,0.04,0.04,0.08,0.08]
[null,"AGETOP_I",3393,"PARAFUSO P/BUCHA S-6","un",2,0.08,0.08,0.16,0.16]
[null,"SINAPI_I",37556,"PLACA DE SINALIZACAO DE SEGURANCA CONTRA INCENDIO, FOTOLUMINESCENTE, QUADRADA, *20 X 20* CM, EM PVC *2* MM ANTI-CHAMAS (SIMBOLOS, CORES E PICTOGRAMAS CONFORME NBR 13434)","UN    ",1,24.29,24.29,24.29,24.29]
[null,"MATERIAL (C) - TOTAL",null,null,null,null,null,null,24.529999999999998,24.529999999999998]

{"sheet":"Cotações","index":8,"n_rows":92,"n_cols":9,"rows_kept":92,"cut":false,"hidden":false,"merged":[[8,0,8,8],[0,0,0,8],[1,0,1,9],[2,0,2,8],[3,0,3,6],[3,7,3,9],[4,0,4,6],[4,7,4,9],[5,0,5,8],[6,0,6,6],[6,7,6,9],[7,0,7,6],[7,7,7,9],[9,0,9,2],[9,3,9,6],[9,7,9,8],[10,0,10,2],[10,3,10,6],[10,8,10,9],[14,0,14,8],[15,0,15,9],[11,0,11,9],[12,0,12,2],[12,3,12,6],[12,7,12,8],[13,0,13,2],[13,3,13,6],[13,8,13,9],[16,7,17,8],[18,7,18,8],[19,3,19,4],[19,5,19,6],[19,7,19,8],[16,1,17,1],[16,2,17,2],[16,3,17,3],[16,4,17,4],[16,5,16,6],[23,3,23,4],[23,7,23,8],[24,3,24,4],[24,7,24,8],[25,3,25,8],[20,3,20,4],[20,7,20,8],[21,3,21,4],[21,7,21,8],[22,3,22,4],[22,7,22,8],[27,7,28,8],[29,7,29,8],[30,3,30,4],[30,5,30,6],[30,7,30,8],[27,1,28,1],[27,2,28,2],[27,3,28,3],[27,4,28,4],[27,5,27,6],[34,3,34,4],[34,7,34,8],[35,3,35,4],[35,7,35,8],[36,3,36,8],[31,3,31,4],[31,7,31,8],[32,3,32,4],[32,7,32,8],[33,3,33,4],[33,7,33,8],[38,7,39,8],[40,7,40,8],[41,3,41,4],[41,5,41,6],[41,7,41,8],[38,1,39,1],[38,2,39,2],[38,3,39,3],[38,4,39,4],[38,5,38,6],[45,3,45,4],[45,7,45,8],[46,3,46,4],[46,7,46,8],[47,3,47,8],[42,3,42,4],[42,7,42,8],[43,3,43,4],[43,7,43,8],[44,3,44,4],[44,7,44,8],[49,7,50,8],[51,7,51,8],[52,3,52,4],[52,5,52,6],[52,7,52,8],[49,1,50,1],[49,2,50,2],[49,3,50,3],[49,4,50,4],[49,5,49,6],[56,3,56,4],[56,7,56,8],[57,3,57,4],[57,7,57,8],[58,3,58,8],[53,3,53,4],[53,7,53,8],[54,3,54,4],[54,7,54,8],[55,3,55,4],[55,7,55,8],[60,7,61,8],[62,7,62,8],[63,3,63,4],[63,5,63,6],[63,7,63,8],[60,1,61,1],[60,2,61,2],[60,3,61,3],[60,4,61,4],[60,5,60,6],[67,3,67,4],[67,7,67,8],[68,3,68,4],[68,7,68,8],[69,3,69,8],[64,3,64,4],[64,7,64,8],[65,3,65,4],[65,7,65,8],[66,3,66,4],[66,7,66,8],[71,7,72,8],[73,7,73,8],[74,3,74,4],[74,5,74,6],[74,7,74,8],[71,1,72,1],[71,2,72,2],[71,3,72,3],[71,4,72,4],[71,5,71,6],[78,3,78,4],[78,7,78,8],[79,3,79,4],[79,7,79,8],[80,3,80,8],[75,3,75,4],[75,7,75,8],[76,3,76,4],[76,7,76,8],[77,3,77,4],[77,7,77,8],[82,7,83,8],[84,7,84,8],[85,3,85,4],[85,5,85,6],[85,7,85,8],[82,1,83,1],[82,2,83,2],[82,3,83,3],[82,4,83,4],[82,5,82,6],[89,3,89,4],[89,7,89,8],[90,3,90,4],[90,7,90,8],[91,3,91,8],[86,3,86,4],[86,7,86,8],[87,3,87,4],[87,7,87,8],[88,3,88,4],[88,7,88,8]]}
[]
[]
[]
["UNIDADE ESCOLAR",null,null,null,null,null,null,"CÓDIGO INEP"]
[{"$f":"Orçamento!$O$4","v":"COLÉGIO ESTADUAL ELVIRA LEÃO BARRETO"},null,null,null,null,null,null,{"$f":"Orçamento!$V$4","v":52042910}]
[]
["OBRA",null,null,null,null,null,null,"CIDADE"]
[{"$f":"Orçamento!$O$7","v":"REFORMA"},null,null,null,null,null,null,{"$f":"Orçamento!$V$7","v":"SIMOLÂNDIA"}]
[]
["CRE",null,null,"ENDEREÇO",null,null,null,"REFERÊNCIA AGETOP"]
[{"$f":"Orçamento!$O$10","v":"POSSE"},null,null,{"$f":"Orçamento!$R$10","v":"R HUMBERTO ALENCAR CASTELO BRANCO S/N, CENTRO, CEP:73930-000"},null,null,null,{"$f":"Orçamento!$V$10","v":"DEZ/18"},{"$f":"Orçamento!$W$10","v":"DESONERADA"}]
[]
["DATA",null,null,"ÁREA TOTAL CONSTRUÍDA (M²)",null,null,null,"REFERÊNCIA SINAPI"]
[{"$f":"Orçamento!$S$7","v":"2020-05-12"},null,null,{"$f":"Orçamento!$S$13","v":1267.68},null,null,null,{"$f":"Orçamento!$V$13","v":"MAR/19"},{"$f":"Orçamento!$W$13","v":"DESONERADA"}]
[]
["COTAÇÕES DE PREÇOS - SEE-GO"]
[null,"FONTE","CÓDIGO","DESCRIÇÃO","UNIDADE","MÉDIA",null,"ÍNDICE RETROAÇÃO"]
[null,null,null,null,null,"DESONERADA","ONERADA"]
[195,"COTAÇÃO","COT 195_SEE","LÂMPADA LED TUBULAR 18W ","UN",21.959999999999997,21.959999999999997,""]
[null,null,"EMPRESA","NOME DA EMPRESA",null,"COTAÇÕES",null,"DATA COTAÇÃO"]
[null,null,"E030 - AJEL M...","AJEL MATERIAIS ELÉTRICOS",null,19.89,19.89,""]
[null,null,"E013 - ELETRO...","ELETROTRANSOL",null,25.99,25.99,""]
[null,null,"E014 - MAKRO ...","MAKRO SERVICE",null,20,20,""]
[null,null,"","",null,null,null,""]
[null,null,"","",null,null,null,""]
[null,null,"OBSERVAÇÕES:",""]
[]
[null,"FONTE","CÓDIGO","DESCRIÇÃO","UNIDADE","MÉDIA",null,"ÍNDICE RETROAÇÃO"]
[null,null,null,null,null,"DESONERADA","ONERADA"]
[103,"COTAÇÃO","COT 103_SEE","NIPLE DE REDUÇÃO 1/2\" X 1/4\" BSP","UN",6.0533333333333337,6.0533333333333337,""]
[null,null,"EMPRESA","NOME DA EMPRESA",null,"COTAÇÕES",null,"DATA COTAÇÃO"]
[null,null,"E070 - FOCO R...","FOCO REPRESENTAÇÃO E CONSULTORIA LTDA-ME",null,4.46,4.46,"12/02/2019"]
[null,null,"E071 - CASA D...","CASA DAS PEÇAS COM E INDUSTRIA DE FOGOES LTDA",null,3.9,3.9,"11/02/2019"]
[null,null,"E072 - AMIG I...","AMIG INSTALAÇÃO DE REDE DE GÁS E INCÊNDIO",null,9.8000000000000007,9.8000000000000007,"08/02/2019"]
[null,null,"","",null,null,null,""]
[null,null,"","",null,null,null,""]
[null,null,"OBSERVAÇÕES:",""]
[]
[null,"FONTE","CÓDIGO","DESCRIÇÃO","UNIDADE","MÉDIA",null,"ÍNDICE RETROAÇÃO"]
[null,null,null,null,null,"DESONERADA","ONERADA"]
[104,"COTAÇÃO","COT 104_SEE","NIPLE DE REDUÇÃO 3/4\" X 1/2\" BSP","UN",9.7099999999999991,9.7099999999999991,""]
[null,null,"EMPRESA","NOME DA EMPRESA",null,"COTAÇÕES",null,"DATA COTAÇÃO"]
[null,null,"E070 - FOCO R...","FOCO REPRESENTAÇÃO E CONSULTORIA LTDA-ME",null,10.93,10.93,"12/02/2019"]
[null,null,"E071 - CASA D...","CASA DAS PEÇAS COM E INDUSTRIA DE FOGOES LTDA",null,5.5,5.5,"11/02/2019"]
[null,null,"E072 - AMIG I...","AMIG INSTALAÇÃO DE REDE DE GÁS E INCÊNDIO",null,12.7,12.7,"08/02/2019"]
[null,null,"","",null,null,null,""]
[null,null,"","",null,null,null,""]
[null,null,"OBSERVAÇÕES:",""]
[]
[null,"FONTE","CÓDIGO","DESCRIÇÃO","UNIDADE","MÉDIA",null,"ÍNDICE RETROAÇÃO"]
[null,null,null,null,null,"DESONERADA","ONERADA"]
[281,"COTAÇÃO","COT 281_SEE","VÁLVULA UGV 3/4\" (S) LATÃO","UN ",15.836666666666666,15.836666666666666,""]
[null,null,"EMPRESA","NOME DA EMPRESA",null,"COTAÇÕES",null,"DATA COTAÇÃO"]
[null,null,"E070 - FOCO R...","FOCO REPRESENTAÇÃO E CONSULTORIA LTDA-ME",null,12.51,12.51,"12/02/2019"]
[null,null,"E071 - CASA D...","CASA DAS PEÇAS COM E INDUSTRIA DE FOGOES LTDA",null,17.5,17.5,"11/02/2019"]
[null,null,"E072 - AMIG I...","AMIG INSTALAÇÃO DE REDE DE GÁS E INCÊNDIO",null,17.5,17.5,"08/02/2019"]
[null,null,"",""]
[null,null,"","",null,null,null,""]
[null,null,"OBSERVAÇÕES:",""]
[]
[null,"FONTE","CÓDIGO","DESCRIÇÃO","UNIDADE","MÉDIA",null,"ÍNDICE RETROAÇÃO"]
[null,null,null,null,null,"DESONERADA","ONERADA"]
[282,"COTAÇÃO","COT 282_SEE","VÁLVULA UGV 1/2\" (S) LATÃO","UN ",15.166666666666666,15.166666666666666,""]
[null,null,"EMPRESA","NOME DA EMPRESA",null,"COTAÇÕES",null,"DATA COTAÇÃO"]
[null,null,"E070 - FOCO R...","FOCO REPRESENTAÇÃO E CONSULTORIA LTDA-ME",null,11.2,11.2,"12/02/2019"]
[null,null,"E071 - CASA D...","CASA DAS PEÇAS COM E INDUSTRIA DE FOGOES LTDA",null,17.5,17.5,"11/02/2019"]
[null,null,"E072 - AMIG I...","AMIG INSTALAÇÃO DE REDE DE GÁS E INCÊNDIO",null,16.8,16.8,"08/02/2019"]
[null,null,"","",null,null,null,""]
[null,null,"","",null,null,null,""]
[null,null,"OBSERVAÇÕES:",""]
[]
[null,"FONTE","CÓDIGO","DESCRIÇÃO","UNIDADE","MÉDIA",null,"ÍNDICE RETROAÇÃO"]
[null,null,null,null,null,"DESONERADA","ONERADA"]
[102,"COTAÇÃO","COT 102_SEE","REGULADOR DE 2º ESTÁGIO 5KG/H","UN",59.833333333333336,59.833333333333336,""]
[null,null,"EMPRESA","NOME DA EMPRESA",null,"COTAÇÕES",null,"DATA COTAÇÃO"]
[null,null,"E070 - FOCO R...","FOCO REPRESENTAÇÃO E CONSULTORIA LTDA-ME",null,38.9,38.9,"12/02/2019"]
[null,null,"E071 - CASA D...","CASA DAS PEÇAS COM E INDUSTRIA DE FOGOES LTDA",null,55.599999999999994,55.599999999999994,"11/02/2019"]
[null,null,"E072 - AMIG I...","AMIG INSTALAÇÃO DE REDE DE GÁS E INCÊNDIO",null,85,85,"08/02/2019"]
[null,null,"","",null,null,null,""]
[null,null,"","",null,null,null,""]
[null,null,"OBSERVAÇÕES:","AMIG enviou cotação de regulador de 2º estágio de 12kg/h."]
[]
[null,"FONTE","CÓDIGO","DESCRIÇÃO","UNIDADE","MÉDIA",null,"ÍNDICE RETROAÇÃO"]
[null,null,null,null,null,"DESONERADA","ONERADA"]
[101,"COTAÇÃO","COT 101_SEE","REGULADOR DE 1º ESTÁGIO 60KG/H MODELO AP-40  COM MANÔMETRO","UN",205.57666666666668,205.57666666666668,""]
[null,null,"EMPRESA","NOME DA EMPRESA",null,"COTAÇÕES",null,"DATA COTAÇÃO"]
[null,null,"E070 - FOCO R...","FOCO REPRESENTAÇÃO E CONSULTORIA LTDA-ME",null,148.72999999999999,148.72999999999999,"12/02/2019"]
[null,null,"E071 - CASA D...","CASA DAS PEÇAS COM E INDUSTRIA DE FOGOES LTDA",null,198,198,"11/02/2019"]
[null,null,"E072 - AMIG I...","AMIG INSTALAÇÃO DE REDE DE GÁS E INCÊNDIO",null,270,270,"08/02/2019"]
[null,null,"","",null,null,null,""]
[null,null,"","",null,null,null,""]
[null,null,"OBSERVAÇÕES:",""]