{"text_format":"1","workbook":"xlsx","n_sheets":9,"sheets":["Orçamento","Resumo ","Somatório","Cronog_60_Dias","Composição BDI","Relatório CENTRAL","Parc Maior Relev","Composições","Cotações"],"not_rendered":{"charts":0,"images":3,"macros":1,"external_links":0,"defined_names":82,"comments":3,"pivot_tables":0},"unopened":[],"bounds":{"document_bytes":16777216,"sheet_cells":100000,"rows_first":2000,"rows_last":500,"rows_between":2000,"halvings":0,"cell_chars":16384,"cell_head_chars":4096},"cells_cut":0,"cells_raw":0,"read":"whole","date_system":"1900"}

{"sheet":"Orçamento","index":0,"n_rows":651,"n_cols":24,"rows_kept":651,"cut":false,"hidden":false,"merged":[[586,16,586,22],[8,12,9,12],[621,18,621,20],[621,21,621,22],[0,14,0,22],[8,14,8,16],[9,14,9,16],[11,14,11,16],[12,14,12,16],[14,14,14,22],[1,14,1,22],[4,14,4,22],[7,14,7,22],[605,18,605,20],[605,21,605,22],[613,21,613,22],[602,15,602,17],[603,15,603,17],[604,15,604,17],[606,21,606,22],[614,18,614,20],[614,21,614,22],[612,18,612,20],[612,21,612,22],[620,18,620,20],[620,21,620,22],[607,18,607,20],[607,21,607,22],[600,18,600,20],[600,21,600,22],[622,18,622,20],[622,21,622,22],[576,20,576,21],[598,18,598,20],[598,21,598,22],[599,18,599,20],[599,21,599,22],[597,18,597,20],[597,21,597,22],[606,18,606,20],[577,20,577,21],[588,18,588,22],[594,18,594,20],[594,21,594,22],[595,18,595,20],[595,21,595,22],[596,18,596,20],[596,21,596,22],[619,18,619,20],[619,21,619,22],[616,21,616,22],[617,18,617,20],[617,21,617,22],[618,18,618,20],[618,21,618,22],[608,18,608,20],[608,21,608,22],[615,18,615,20],[615,21,615,22],[610,21,610,22],[611,18,611,20],[611,21,611,22],[613,18,613,20],[609,18,609,20],[609,21,609,22],[610,18,610,20],[614,15,614,17],[615,15,615,17],[616,15,616,17],[617,15,617,17],[618,15,618,17],[591,14,591,23],[580,20,580,21],[579,20,579,21],[575,17,580,17],[575,20,575,21],[592,18,592,20],[592,21,592,22],[593,18,593,20],[593,21,593,22],[581,20,581,21],[601,18,601,20],[601,21,601,22],[602,18,602,20],[602,21,602,22],[603,18,603,20],[603,21,603,22],[604,18,604,20],[604,21,604,22],[616,18,616,20],[593,15,593,17],[594,15,594,17],[595,15,595,17],[596,15,596,17],[597,15,597,17],[598,15,598,17],[599,15,599,17],[600,15,600,17],[601,15,601,17],[605,15,605,17],[606,15,606,17],[607,15,607,17],[608,15,608,17],[609,15,609,17],[610,15,610,17],[611,15,611,17],[612,15,612,17],[613,15,613,17],[583,16,583,22],[584,16,584,22],[585,16,585,22],[3,21,3,22],[2,21,2,22],[5,21,5,22],[10,14,10,23],[13,14,13,23],[6,21,6,22],[9,17,9,20],[2,14,2,20],[3,14,3,20],[5,18,5,20],[6,18,6,20],[11,18,11,20],[12,18,12,20],[6,14,6,17],[5,14,5,17],[587,16,587,22],[650,18,650,20],[650,21,650,22],[647,14,647,17],[644,15,644,17],[644,18,644,20],[644,21,644,22],[645,15,645,17],[645,18,645,20],[645,21,645,22],[646,15,646,17],[646,18,646,20],[646,21,646,22],[649,18,649,20],[649,21,649,22],[648,18,648,20],[648,21,648,22],[625,14,625,23],[626,18,626,20],[626,21,626,22],[627,15,627,17],[627,18,627,20],[627,21,627,22],[628,15,628,17],[619,14,619,17],[626,15,626,17],[592,15,592,17],[647,18,647,20],[647,21,647,22],[635,15,635,17],[635,18,635,20],[635,21,635,22],[636,15,636,17],[636,18,636,20],[636,21,636,22],[637,15,637,17],[637,18,637,20],[637,21,637,22],[641,15,641,17],[641,18,641,20],[641,21,641,22],[642,15,642,17],[642,18,642,20],[642,21,642,22],[643,15,643,17],[632,15,632,17],[628,18,628,20],[628,21,628,22],[643,18,643,20],[643,21,643,22],[638,15,638,17],[638,18,638,20],[638,21,638,22],[639,15,639,17],[639,18,639,20],[639,21,639,22],[640,15,640,17],[640,18,640,20],[640,21,640,22],[632,18,632,20],[632,21,632,22],[633,15,633,17],[633,18,633,20],[633,21,633,22],[634,15,634,17],[634,18,634,20],[634,21,634,22],[629,15,629,17],[629,18,629,20],[629,21,629,22],[630,15,630,17],[630,18,630,20],[630,21,630,22],[631,15,631,17],[631,18,631,20],[631,21,631,22]]}
[]
[]
[null,null,null,null,null,null,null,null,null,null,null,null,null,null,"UNIDADE ESCOLAR",null,null,null,null,null,null,"CÓDIGO INEP"]
[null,null,null,null,null,null,null,null,null,null,null,null,null,null,"COLÉGIO ESTADUAL ELVIRA LEÃO BARRETO",null,null,null,null,null,null,52042910]
[]
["Nmax",null,null,null,null,null,null,null,null,null,null,null,null,null,"OBRA",null,null,null,"DATA",null,null,"CIDADE"]
[{"$f":"MAX($C$18:$C$575)","v":4},null,null,null,null,null,null,null,null,null,null,null,null,null,"REFORMA",null,null,null,"2020-05-12",null,null,"SIMOLÂNDIA"]
[]
[null,null,null,null,null,null,null,null,null,null,null,null,"",null,"CRE",null,null,"ENDEREÇO",null,null,null,"REFERÊNCIA AGETOP"]
[null,null,null,null,null,null,null,null,null,null,null,null,null,null,"POSSE",null,null,"R HUMBERTO ALENCAR CASTELO BRANCO S/N, CENTRO, CEP:73930-000",null,null,null,"DEZ/18","DESONERADA"]
[]
[null,null,null,null,null,null,null,null,null,null,null,null,null,null,"ÁREA EXISTENTE (M²)",null,null,"ÁREA A CONSTRUIR (M²)","ÁREA TOTAL CONSTRUÍDA (M²)",null,null,"REFERÊNCIA SINAPI"]
[null,null,null,null,null,null,null,null,null,null,null,null,null,null,1086.18,null,null,181.5,1267.68,null,null,"MAR/19","DESONERADA"]
[]
[null,null,null,null,null,null,null,null,null,null,null,"FILTRO",null,null,"PLANILHA ORÇAMENTÁRIA"]
{"$rows_left_out":637}
{"sheet":"Resumo ","index":1,"n_rows":39,"n_cols":9,"rows_kept":39,"cut":false,"hidden":false,"merged":[[42,3,42,7],[11,1,11,2],[12,1,12,2],[15,2,15,3],[16,2,16,3],[14,1,14,8],[17,2,17,3],[23,2,23,3],[18,2,18,3],[19,2,19,3],[20,2,20,3],[41,3,41,7],[24,2,24,3],[26,2,26,3],[27,2,27,3],[38,1,38,8],[1,1,1,8],[2,6,2,8],[3,6,3,8],[4,1,4,8],[5,6,5,8],[6,6,6,8],[7,1,7,8],[8,6,8,8],[9,6,9,8],[13,1,13,8],[0,1,0,8],[36,1,36,5],[2,1,2,5],[3,1,3,5],[5,1,5,5],[6,1,6,5],[8,1,8,5],[9,1,9,5],[11,3,11,5],[12,3,12,5],[10,1,10,8],[11,6,11,8],[12,6,12,8],[25,2,25,3],[21,2,21,3],[22,2,22,3],[13,0,14,0],[34,2,34,3],[35,2,35,3],[31,2,31,3],[32,2,32,3],[33,2,33,3],[28,2,28,3],[29,2,29,3],[30,2,30,3]]}
[]
[]
[null,"UNIDADE ESCOLAR",null,null,null,null,"CÓDIGO INEP"]
[null,{"$f":"Orçamento!$O$4","v":"COLÉGIO ESTADUAL ELVIRA LEÃO BARRETO"},null,null,null,null,{"$f":"Orçamento!V4","v":52042910}]
[]
[null,"OBRA",null,null,null,null,"CIDADE"]
[null,{"$f":"Orçamento!$O$7","v":"REFORMA"},null,null,null,null,{"$f":"Orçamento!$V$7","v":"SIMOLÂNDIA"}]
[]
[null,"ENDEREÇO",null,null,null,null,"CRE"]
[null,{"$f":"Orçamento!$R$10","v":"R HUMBERTO ALENCAR CASTELO BRANCO S/N, CENTRO, CEP:73930-000"},null,null,null,null,{"$f":"Orçamento!$O$10","v":"POSSE"}]
[]
[null,"REFERÊNCIA",null,"DATA",null,null,"ÁREA TOTAL CONSTRUÍDA (M²)"]
[null,{"$f":"CONCATENATE(\"AGETOP E SINAPI - \",Orçamento!$W$10)","v":"AGETOP E SINAPI - DESONERADA"},null,{"$f":"Orçamento!$S$7","v":"2020-05-12"},null,null,{"$f":"Orçamento!$S$13","v":1267.68}]
["FILTRO"]
[null,"RESUMO GERAL DO ORÇAMENTO"]
{"$rows_left_out":25}
{"sheet":"Somatório","index":2,"n_rows":45,"n_cols":6,"rows_kept":45,"cut":false,"hidden":false,"merged":[[0,1,0,5],[14,1,14,5],[2,1,2,3],[2,4,2,5],[3,1,3,3],[3,4,3,5],[5,1,5,3],[5,4,5,5],[6,1,6,3],[6,4,6,5],[8,1,8,3],[8,4,8,5],[1,1,1,5],[4,1,4,5],[7,1,7,5],[10,1,10,5],[9,1,9,3],[9,4,9,5],[11,1,11,2],[11,4,11,5],[12,1,12,2],[12,4,12,5],[13,0,14,0],[42,1,42,2],[44,1,44,5],[47,3,47,5],[48,3,48,5],[13,1,13,5]]}
[]
[]
[null,"UNIDADE ESCOLAR",null,null,"CÓDIGO INEP"]
[null,{"$f":"Orçamento!$O$4","v":"COLÉGIO ESTADUAL ELVIRA LEÃO BARRETO"},null,null,{"$f":"Orçamento!V4","v":52042910}]
[]
[null,"OBRA",null,null,"CIDADE"]
[null,{"$f":"Orçamento!$O$7","v":"REFORMA"},null,null,{"$f":"Orçamento!$V$7","v":"SIMOLÂNDIA"}]
[]
[null,"ENDEREÇO",null,null,"CRE"]
[null,{"$f":"Orçamento!$R$10","v":"R HUMBERTO ALENCAR CASTELO BRANCO S/N, CENTRO, CEP:73930-000"},null,null,{"$f":"Orçamento!$O$10","v":"POSSE"}]
[]
[null,"REFERÊNCIA",null,"DATA","ÁREA TOTAL CONSTRUÍDA (M²)"]
[null,{"$f":"CONCATENATE(\"AGETOP E SINAPI - \",Orçamento!$W$10)","v":"AGETOP E SINAPI - DESONERADA"},null,{"$f":"Orçamento!$S$7","v":"2020-05-12"},{"$f":"Orçamento!$S$13","v":1267.68}]
["FILTRO"]
[null,"SOMATÓRIO DE SERVIÇOS"]
{"$rows_left_out":31}
{"sheet":"Cronog_60_Dias","index":3,"n_rows":99,"n_cols":14,"rows_kept":99,"cut":false,"hidden":false,"merged":[[10,1,10,13],[9,8,9,13],[8,8,8,13],[3,8,3,13],[6,8,6,13],[5,8,5,13],[3,1,3,7],[56,4,58,4],[29,3,31,3],[35,1,37,2],[35,4,37,4],[50,3,52,3],[53,3,55,3],[12,13,13,13],[13,1,13,2],[13,5,13,8],[13,9,13,12],[12,3,13,3],[12,9,12,12],[14,1,16,2],[12,5,12,8],[17,1,19,2],[17,4,19,4],[17,5,17,8],[56,1,58,2],[68,4,70,4],[44,3,46,3],[62,1,64,2],[62,4,64,4],[38,1,40,2],[38,4,40,4],[59,3,61,3],[44,1,46,2],[44,4,46,4],[53,1,55,2],[50,1,52,2],[50,4,52,4],[20,1,22,2],[20,4,22,4],[20,5,20,8],[20,9,20,12],[22,5,22,8],[22,9,22,12],[20,3,22,3],[83,3,85,3],[53,4,55,4],[59,1,61,2],[59,4,61,4],[74,1,76,2],[77,1,79,2],[77,4,79,4],[80,1,82,2],[65,1,67,2],[68,3,70,3],[62,3,64,3],[68,1,70,2],[56,3,58,3],[65,4,67,4],[71,3,73,3],[74,3,76,3],[74,4,76,4],[14,3,16,3],[17,3,19,3],[14,4,16,4],[14,5,14,8],[14,9,14,12],[16,5,16,8],[16,9,16,12],[23,9,23,12],[25,5,25,8],[25,9,25,12],[17,9,17,12],[19,5,19,8],[19,9,19,12],[26,1,28,2],[26,4,28,4],[26,5,26,8],[26,9,26,12],[28,5,28,8],[28,9,28,12],[23,3,25,3],[23,1,25,2],[23,4,25,4],[23,5,23,8],[26,3,28,3],[29,9,29,12],[31,5,31,8],[31,9,31,12],[32,1,34,2],[32,4,34,4],[32,5,32,8],[32,9,32,12],[34,5,34,8],[34,9,34,12],[32,3,34,3],[29,5,29,8],[29,1,31,2],[29,4,31,4],[35,9,35,12],[37,5,37,8],[37,9,37,12],[35,3,37,3],[40,9,40,12],[38,3,40,3],[38,9,38,12],[41,1,43,2],[41,4,43,4],[41,5,41,8],[41,9,41,12],[43,5,43,8],[43,9,43,12],[41,3,43,3],[35,5,35,8],[38,5,38,8],[40,5,40,8],[44,9,44,12],[46,5,46,8],[46,9,46,12],[47,1,49,2],[47,4,49,4],[47,5,47,8],[47,9,47,12],[49,5,49,8],[49,9,49,12],[44,5,44,8],[47,3,49,3],[53,9,53,12],[55,5,55,8],[55,9,55,12],[50,5,50,8],[50,9,50,12],[52,5,52,8],[52,9,52,12],[56,9,56,12],[58,5,58,8],[58,9,58,12],[53,5,53,8],[56,5,56,8],[68,5,68,8],[65,5,65,8],[65,9,65,12],[67,5,67,8],[67,9,67,12],[65,3,67,3],[62,9,62,12],[64,5,64,8],[64,9,64,12],[62,5,62,8],[95,1,95,2],[95,5,95,8],[95,9,95,12],[97,1,97,4],[98,1,98,13],[86,9,86,12],[88,5,88,8],[88,9,88,12],[85,5,85,8],[85,9,85,12],[89,1,91,2],[89,4,91,4],[89,5,89,8],[89,9,89,12],[91,5,91,8],[91,9,91,12],[89,3,91,3],[86,4,88,4],[86,5,86,8],[86,3,88,3],[83,1,85,2],[83,4,85,4],[83,5,83,8],[83,9,83,12],[94,1,94,2],[94,5,94,8],[94,9,94,12],[76,5,76,8],[76,9,76,12],[77,5,77,8],[77,9,77,12],[79,5,79,8],[79,9,79,12],[80,5,80,8],[80,9,80,12],[82,5,82,8],[82,9,82,12],[77,3,79,3],[80,3,82,3],[86,1,88,2],[80,4,82,4],[12,0,13,0],[9,0,11,0],[11,1,11,13],[92,1,92,2],[92,5,92,8],[92,9,92,12],[93,1,93,2],[93,5,93,8],[93,9,93,12],[74,9,74,12],[74,5,74,8],[68,9,68,12],[70,5,70,8],[70,9,70,12],[59,5,59,8],[71,1,73,2],[71,4,73,4],[71,5,71,8],[71,9,71,12],[73,5,73,8],[73,9,73,12],[59,9,59,12],[61,5,61,8],[61,9,61,12],[2,1,2,7],[5,1,5,7],[6,1,6,7],[8,1,8,7],[9,1,9,7],[4,1,4,13],[7,1,7,13],[0,1,0,13],[1,1,1,13],[2,8,2,13]]}
[]
[]
[null,"UNIDADE ESCOLAR",null,null,null,null,null,null,"PRAZO"]
[null,{"$f":"Orçamento!$O$4","v":"COLÉGIO ESTADUAL ELVIRA LEÃO BARRETO"},null,null,null,null,null,null,"60 DIAS CORRIDOS"]
[]
[null,"OBRA",null,null,null,null,null,null,"DATA"]
[null,{"$f":"Orçamento!$O$7","v":"REFORMA"},null,null,null,null,null,null,{"$f":"Orçamento!$S$7","v":"2020-05-12"}]
[]
[null,"LOCAL",null,null,null,null,null,null,"ÁREA TOTAL CONSTRUÍDA (M²)"]
["FILTRO",{"$f":"Orçamento!$V$7","v":"SIMOLÂNDIA"},null,null,null,null,null,null,{"$f":"Orçamento!$S$13","v":1267.68}]
[]
[null,"CRONOGRAMA - FÍSICO FINANCEIRO"]
["↓","CUSTO TOTAL:",{"$f":"D93","v":0},"VALOR","Dias:",30,null,null,null,60,null,null,null,"TOTAL"]
[null,"DESCRIÇÃO DOS SERVIÇOS",null,null,"%","1ª PARCELA",null,null,null,"2ª PARCELA"]
[{"$f":"IF(D15>0,\"F\",\"\")","v":""},"SERVIÇOS PRELIMINARES",null,{"$f":"Orçamento!V594","v":0},{"$f":"Orçamento!X594","v":0},{"$f":"ROUND(F17*$D$15,2)","v":0},null,null,null,{"$f":"ROUND(J17*$D$15,2)","v":0},null,null,null,{"$f":"SUM(F15:M15)","v":0}]
{"$rows_left_out":85}
{"sheet":"Composição BDI","index":4,"n_rows":45,"n_cols":9,"rows_kept":45,"cut":false,"hidden":false,"merged":[[18,5,18,8],[17,0,17,3],[16,0,16,3],[44,0,44,3],[42,0,42,3],[43,0,43,3],[18,0,18,3],[36,0,36,3],[39,0,39,3],[38,0,38,3],[40,0,40,3],[29,0,29,2],[32,0,32,3],[33,0,33,3],[34,0,34,3],[35,0,35,3],[0,0,0,3],[1,0,1,3],[4,0,4,3],[7,0,7,3],[10,0,10,3],[2,0,2,3],[3,0,3,3],[5,0,5,3],[6,0,6,3],[8,0,8,3],[9,0,9,3],[11,0,11,3],[12,0,12,3],[14,0,14,3],[15,0,15,3],[13,0,13,3]]}
[]
[]
["UNIDADE ESCOLAR"]
[{"$f":"Orçamento!$O$4","v":"COLÉGIO ESTADUAL ELVIRA LEÃO BARRETO"}]
[]
["OBRA"]
[{"$f":"Orçamento!$O$7","v":"REFORMA"}]
[]
["ENDEREÇO"]
[{"$f":"Orçamento!$R$10","v":"R HUMBERTO ALENCAR CASTELO BRANCO S/N, CENTRO, CEP:73930-000"}]
[]
["CIDADE"]
[{"$f":"Orçamento!$V$7","v":"SIMOLÂNDIA"}]
[]
["CRE"]
{"$rows_left_out":31}
{"sheet":"Relatório CENTRAL","index":5,"n_rows":40,"n_cols":5,"rows_kept":40,"cut":false,"hidden":false,"merged":[[7,1,7,4],[8,1,8,2],[8,3,8,4],[9,1,9,2],[10,1,10,4],[11,1,11,4],[39,1,39,2],[9,0,11,0],[0,1,0,4],[6,3,6,4],[9,3,9,4],[1,1,1,4],[2,1,2,2],[2,3,2,4],[3,1,3,2],[3,3,3,4],[4,1,4,4],[5,1,5,2],[5,3,5,4],[6,1,6,2]]}
[]
[]
[null,"UNIDADE ESCOLAR",null,"CIDADE"]
[null,{"$f":"Orçamento!$O$4","v":"COLÉGIO ESTADUAL ELVIRA LEÃO BARRETO"},null,{"$f":"Orçamento!$V$7","v":"SIMOLÂNDIA"}]
[]
[null,"OBRA",null,"CRE"]
[null,{"$f":"Orçamento!$O$7","v":"REFORMA"},null,{"$f":"Orçamento!$O$10","v":"POSSE"}]
[]
[null,"ENDEREÇO",null,"DATA"]
["FILTRO",{"$f":"Orçamento!$R$10","v":"R HUMBERTO ALENCAR CASTELO BRANCO S/N, CENTRO, CEP:73930-000"},null,{"$f":"Orçamento!$S$7","v":"2020-05-12"}]
[]
[null,"RELATÓRIO CENTRAL"]
["↓","CÓDIGO","ETAPA","PREÇO  (R$) C/ BDI","PARTIC  ( % )"]
[{"$f":"IF(D14>0,\"F\",\"\")","v":""},{"$f":"Orçamento!O594","v":"a."},{"$f":"Orçamento!P594","v":"SERVIÇOS PRELIMINARES"},{"$f":"Orçamento!V594","v":0},{"$f":"Orçamento!X594","v":0}]
[{"$f":"IF(D15>0,\"F\",\"\")","v":""},{"$f":"Orçamento!O595","v":"b."},{"$f":"Orçamento!P595","v":"TRANSPORTES"},{"$f":"Orçamento!V595","v":0},{"$f":"Orçamento!X595","v":0}]
{"$rows_left_out":26}
{"sheet":"Parc Maior Relev","index":6,"n_rows":21,"n_cols":7,"rows_kept":21,"cut":false,"hidden":false,"merged":[[10,0,12,0],[8,1,8,3],[8,4,8,6],[21,3,21,7],[19,1,19,6],[0,1,0,6],[11,1,11,6],[1,1,1,6],[2,1,2,3],[2,4,2,6],[3,1,3,3],[3,4,3,6],[4,1,4,6],[5,1,5,3],[5,4,5,6],[9,1,9,3],[9,4,9,6],[10,1,10,6],[6,1,6,3],[6,4,6,6],[7,1,7,6]]}
[]
[]
[null,"UNIDADE ESCOLAR",null,null,"CÓDIGO INEP"]
[null,{"$f":"Orçamento!$O$4","v":"COLÉGIO ESTADUAL ELVIRA LEÃO BARRETO"},null,null,{"$f":"Orçamento!$V$4","v":52042910}]
[]
[null,"OBRA",null,null,"CIDADE"]
[null,{"$f":"Orçamento!$O$7","v":"REFORMA"},null,null,{"$f":"Orçamento!$V$7","v":"SIMOLÂNDIA"}]
[]
[null,"CRE",null,null,"ÁREA TOTAL CONSTRUÍDA (M²)"]
[null,{"$f":"Orçamento!$O$10","v":"POSSE"},null,null,{"$f":"Orçamento!$S$13","v":1267.68}]
["FILTRO"]
[null,"PARCELA DE MAIOR RELEVÂNCIA"]
[null,"CÓDIGO","SERVIÇO","DESCRIÇÃO","UNID","QUANT","PARC. MAIOR RELEV (50%)"]
[{"$f":"IF(F14>0,\"F\",\"\")","v":"F"},{"$f":"Somatório!B37","v":"u."},{"$f":"IFERROR(VLOOKUP(B14,Orçamento!$O$594:$P$619,2,FALSE),\"(inserir código ao lado)\")","v":"REVESTIMENTO DE PISO"},"GRANITINA","M2",{"$f":"68.6+59.98","v":128.57999999999998},{"$f":"F14*0.5","v":64.289999999999992}]
[{"$f":"IF(F15>0,\"F\",\"\")","v":"F"},{"$f":"Somatório!B31","v":"o."},{"$f":"IFERROR(VLOOKUP(B15,Orçamento!$O$594:$P$619,2,FALSE),\"(inserir código ao lado)\")","v":"COBERTURAS"},"TELHA CERAMICA","M2",{"$f":"400+71.37+88.69","v":560.05999999999995},280.02999999999997]
{"$rows_left_out":7}
{"sheet":"Composições","index":7,"n_rows":219,"n_cols":10,"rows_kept":219,"cut":false,"hidden":false,"merged":[[0,0,0,8],[10,0,10,2],[10,3,10,6],[11,0,11,9],[12,0,12,2],[12,3,12,6],[12,7,12,8],[7,0,7,6],[9,0,9,2],[9,3,9,6],[9,7,9,8],[3,0,3,6],[4,0,4,6],[15,0,15,9],[13,0,13,2],[13,3,13,6],[1,0,1,9],[3,7,3,9],[4,7,4,9],[6,7,6,9],[7,7,7,9],[6,0,6,6],[10,8,10,9],[13,8,13,9],[14,0,14,9],[8,0,8,9],[5,0,5,9],[2,0,2,9],[16,5,17,5],[16,6,16,7],[16,8,16,9],[22,1,22,7],[26,1,26,7],[16,0,17,0],[16,1,17,1],[16,2,17,2],[16,3,17,3],[16,4,17,4],[28,5,29,5],[28,6,28,7],[28,8,28,9],[34,1,34,7],[38,1,38,7],[28,0,29,0],[28,1,29,1],[28,2,29,2],[28,3,29,3],[28,4,29,4],[40,5,41,5],[40,6,40,7],[40,8,40,9],[44,1,44,7],[48,1,48,7],[40,0,41,0],[40,1,41,1],[40,2,41,2],[40,3,41,3],[40,4,41,4],[50,5,51,5],[50,6,50,7],[50,8,50,9],[56,1,56,7],[63,1,63,7],[50,0,51,0],[50,1,51,1],[50,2,51,2],[50,3,51,3],[50,4,51,4],[65,5,66,5],[65,6,65,7],[65,8,65,9],[72,1,72,7],[86,1,86,7],[65,0,66,0],[65,1,66,1],[65,2,66,2],[65,3,66,3],[65,4,66,4],[88,5,89,5],[88,6,88,7],[88,8,88,9],[94,1,94,7],[98,1,98,7],[88,0,89,0],[88,1,89,1],[88,2,89,2],[88,3,89,3],[88,4,89,4],[100,5,101,5],[100,6,100,7],[100,8,100,9],[106,1,106,7],[110,1,110,7],[100,0,101,0],[100,1,101,1],[100,2,101,2],[100,3,101,3],[100,4,101,4],[112,5,113,5],[112,6,112,7],[112,8,112,9],[118,1,118,7],[122,1,122,7],[112,0,113,0],[112,1,113,1],[112,2,113,2],[112,3,113,3],[112,4,113,4],[124,5,125,5],[124,6,124,7],[124,8,124,9],[130,1,130,7],[134,1,134,7],[124,0,125,0],[124,1,125,1],[124,2,125,2],[124,3,125,3],[124,4,125,4],[136,5,137,5],[136,6,136,7],[136,8,136,9],[142,1,142,7],[146,1,146,7],[136,0,137,0],[136,1,137,1],[136,2,137,2],[136,3,137,3],[136,4,137,4],[148,5,149,5],[148,6,148,7],[148,8,148,9],[154,1,154,7],[158,1,158,7],[148,0,149,0],[148,1,149,1],[148,2,149,2],[148,3,149,3],[148,4,149,4],[160,5,161,5],[160,6,160,7],[160,8,160,9],[166,1,166,7],[170,1,170,7],[160,0,161,0],[160,1,161,1],[160,2,161,2],[160,3,161,3],[160,4,161,4],[172,5,173,5],[172,6,172,7],[172,8,172,9],[178,1,178,7],[182,1,182,7],[172,0,173,0],[172,1,173,1],[172,2,173,2],[172,3,173,3],[172,4,173,4],[184,5,185,5],[184,6,184,7],[184,8,184,9],[190,1,190,7],[194,1,194,7],[184,0,185,0],[184,1,185,1],[184,2,185,2],[184,3,185,3],[184,4,185,4],[196,5,197,5],[196,6,196,7],[196,8,196,9],[202,1,202,7],[206,1,206,7],[196,0,197,0],[196,1,197,1],[196,2,197,2],[196,3,197,3],[196,4,197,4],[208,5,209,5],[208,6,208,7],[208,8,208,9],[214,1,214,7],[218,1,218,7],[208,0,209,0],[208,1,209,1],[208,2,209,2],[208,3,209,3],[208,4,209,4]]}
[]
[]
[]
["UNIDADE ESCOLAR",null,null,null,null,null,null,"CÓDIGO INEP"]
[{"$f":"Orçamento!$O$4","v":"COLÉGIO ESTADUAL ELVIRA LEÃO BARRETO"},null,null,null,null,null,null,{"$f":"Orçamento!$V$4","v":52042910}]
[]
["OBRA",null,null,null,null,null,null,"CIDADE"]
[{"$f":"Orçamento!$O$7","v":"REFORMA"},null,null,null,null,null,null,{"$f":"Orçamento!$V$7","v":"SIMOLÂNDIA"}]
[]
["CRE",null,null,"ENDEREÇO",null,null,null,"REFERÊNCIA AGETOP"]
[{"$f":"Orçamento!$O$10","v":"POSSE"},null,null,{"$f":"Orçamento!$R$10","v":"R HUMBERTO ALENCAR CASTELO BRANCO S/N, CENTRO, CEP:73930-000"},null,null,null,{"$f":"Orçamento!$V$10","v":"DEZ/18"},{"$f":"Orçamento!$W$10","v":"DESONERADA"}]
[]
["DATA",null,null,"ÁREA TOTAL CONSTRUÍDA (M²)",null,null,null,"REFERÊNCIA SINAPI"]
[{"$f":"Orçamento!$S$7","v":"2020-05-12"},null,null,{"$f":"Orçamento!$S$13","v":1267.68},null,null,null,{"$f":"Orçamento!$V$13","v":"MAR/19"},{"$f":"Orçamento!$W$13","v":"DESONERADA"}]
[]
{"$rows_left_out":205}
{"sheet":"Cotações","index":8,"n_rows":92,"n_cols":9,"rows_kept":92,"cut":false,"hidden":false,"merged":[[8,0,8,8],[0,0,0,8],[1,0,1,9],[2,0,2,8],[3,0,3,6],[3,7,3,9],[4,0,4,6],[4,7,4,9],[5,0,5,8],[6,0,6,6],[6,7,6,9],[7,0,7,6],[7,7,7,9],[9,0,9,2],[9,3,9,6],[9,7,9,8],[10,0,10,2],[10,3,10,6],[10,8,10,9],[14,0,14,8],[15,0,15,9],[11,0,11,9],[12,0,12,2],[12,3,12,6],[12,7,12,8],[13,0,13,2],[13,3,13,6],[13,8,13,9],[16,7,17,8],[18,7,18,8],[19,3,19,4],[19,5,19,6],[19,7,19,8],[16,1,17,1],[16,2,17,2],[16,3,17,3],[16,4,17,4],[16,5,16,6],[23,3,23,4],[23,7,23,8],[24,3,24,4],[24,7,24,8],[25,3,25,8],[20,3,20,4],[20,7,20,8],[21,3,21,4],[21,7,21,8],[22,3,22,4],[22,7,22,8],[27,7,28,8],[29,7,29,8],[30,3,30,4],[30,5,30,6],[30,7,30,8],[27,1,28,1],[27,2,28,2],[27,3,28,3],[27,4,28,4],[27,5,27,6],[34,3,34,4],[34,7,34,8],[35,3,35,4],[35,7,35,8],[36,3,36,8],[31,3,31,4],[31,7,31,8],[32,3,32,4],[32,7,32,8],[33,3,33,4],[33,7,33,8],[38,7,39,8],[40,7,40,8],[41,3,41,4],[41,5,41,6],[41,7,41,8],[38,1,39,1],[38,2,39,2],[38,3,39,3],[38,4,39,4],[38,5,38,6],[45,3,45,4],[45,7,45,8],[46,3,46,4],[46,7,46,8],[47,3,47,8],[42,3,42,4],[42,7,42,8],[43,3,43,4],[43,7,43,8],[44,3,44,4],[44,7,44,8],[49,7,50,8],[51,7,51,8],[52,3,52,4],[52,5,52,6],[52,7,52,8],[49,1,50,1],[49,2,50,2],[49,3,50,3],[49,4,50,4],[49,5,49,6],[56,3,56,4],[56,7,56,8],[57,3,57,4],[57,7,57,8],[58,3,58,8],[53,3,53,4],[53,7,53,8],[54,3,54,4],[54,7,54,8],[55,3,55,4],[55,7,55,8],[60,7,61,8],[62,7,62,8],[63,3,63,4],[63,5,63,6],[63,7,63,8],[60,1,61,1],[60,2,61,2],[60,3,61,3],[60,4,61,4],[60,5,60,6],[67,3,67,4],[67,7,67,8],[68,3,68,4],[68,7,68,8],[69,3,69,8],[64,3,64,4],[64,7,64,8],[65,3,65,4],[65,7,65,8],[66,3,66,4],[66,7,66,8],[71,7,72,8],[73,7,73,8],[74,3,74,4],[74,5,74,6],[74,7,74,8],[71,1,72,1],[71,2,72,2],[71,3,72,3],[71,4,72,4],[71,5,71,6],[78,3,78,4],[78,7,78,8],[79,3,79,4],[79,7,79,8],[80,3,80,8],[75,3,75,4],[75,7,75,8],[76,3,76,4],[76,7,76,8],[77,3,77,4],[77,7,77,8],[82,7,83,8],[84,7,84,8],[85,3,85,4],[85,5,85,6],[85,7,85,8],[82,1,83,1],[82,2,83,2],[82,3,83,3],[82,4,83,4],[82,5,82,6],[89,3,89,4],[89,7,89,8],[90,3,90,4],[90,7,90,8],[91,3,91,8],[86,3,86,4],[86,7,86,8],[87,3,87,4],[87,7,87,8],[88,3,88,4],[88,7,88,8]]}
[]
[]
[]
["UNIDADE ESCOLAR",null,null,null,null,null,null,"CÓDIGO INEP"]
[{"$f":"Orçamento!$O$4","v":"COLÉGIO ESTADUAL ELVIRA LEÃO BARRETO"},null,null,null,null,null,null,{"$f":"Orçamento!$V$4","v":52042910}]
[]
["OBRA",null,null,null,null,null,null,"CIDADE"]
[{"$f":"Orçamento!$O$7","v":"REFORMA"},null,null,null,null,null,null,{"$f":"Orçamento!$V$7","v":"SIMOLÂNDIA"}]
[]
["CRE",null,null,"ENDEREÇO",null,null,null,"REFERÊNCIA AGETOP"]
[{"$f":"Orçamento!$O$10","v":"POSSE"},null,null,{"$f":"Orçamento!$R$10","v":"R HUMBERTO ALENCAR CASTELO BRANCO S/N, CENTRO, CEP:73930-000"},null,null,null,{"$f":"Orçamento!$V$10","v":"DEZ/18"},{"$f":"Orçamento!$W$10","v":"DESONERADA"}]
[]
["DATA",null,null,"ÁREA TOTAL CONSTRUÍDA (M²)",null,null,null,"REFERÊNCIA SINAPI"]
[{"$f":"Orçamento!$S$7","v":"2020-05-12"},null,null,{"$f":"Orçamento!$S$13","v":1267.68},null,null,null,{"$f":"Orçamento!$V$13","v":"MAR/19"},{"$f":"Orçamento!$W$13","v":"DESONERADA"}]
[]
{"$rows_left_out":77}